program: Gaussian 09
title: 000076767
version: EM64L-G09RevD.01
frameworkgroup: C1[X(C9H7Br3O)]
method: RPBEPBE
basis: SDD
operation: Freq
keyword: #p
keyword: freq=noraman
keyword: PBEPBE/SDD
title: #p freq=noraman PBEPBE/SDD
converged: YES YES NO NO
title: Mulliken charges:
elementType: Br Br Br O C C C C C C C C C H H H H H H H
charge: 0.058517 0.054193 0.043930 -0.261401 0.560044 -0.355102 -0.338131 -0.152629 -0.155349 -0.225633 -0.357147 -0.020556 -0.547765 0.276896 0.276742 0.230104 0.231840 0.238425 0.223850 0.219171
chargesum: 0.00000
title: Mulliken charges with hydrogens summed into heavy atoms:
elementType: Br Br Br O C C C C C C C C C
charge: 0.058517 0.054193 0.043930 -0.261401 0.560044 -0.355102 -0.338131 0.124267 0.121394 -0.225633 0.104796 0.217869 -0.104745
polarizability: 2.25985690e+02 6.31794475e+00 1.73162985e+02 2.68326067e+00 -3.90343589e+00 6.06487066e+01
1716.lowfreq: -7.8899 -2.8305 -0.0004 -0.0002 0.0002 3.6178 25.0062 33.0290 74.8298
frequency: 24.7639 33.0202 74.7983 95.2760 104.7098 110.6354 116.1765 152.1155 178.7525 214.4596 220.9691 238.2098 317.6067 347.4634 393.1577 423.7233 497.9631 518.4594 558.4648 596.1551 672.5813 705.3423 733.5131 803.9163 865.5838 875.0853 885.9610 932.2302 962.3078 975.1279 1010.7923 1029.3235 1093.5690 1142.5497 1180.9671 1210.9378 1213.1708 1282.9365 1325.3194 1338.2403 1357.7162 1406.1764 1433.0484 1468.3230 1531.4222 1554.3259 1664.7615 2971.2965 3044.0280 3093.3734 3125.5625 3183.5739 3185.6210 3204.0780
redmass: 5.1339 7.7749 2.0378 7.6828 3.7545 39.5003 18.1127 5.1511 4.6651 6.0010 44.0488 7.3783 4.0830 7.8682 5.6291 2.8484 4.9904 7.1215 3.4111 2.0169 3.9687 10.1844 6.7683 5.8753 1.4323 1.3663 4.2251 1.5717 1.3608 1.7623 1.2582 5.3562 2.4502 1.5989 1.6444 2.2811 1.5264 1.2408 4.5964 1.3188 4.1695 2.4817 1.2490 1.1143 9.5531 7.7242 4.7446 1.0578 1.1055 1.0609 1.0947 1.0931 1.0938 1.1145
irintensity: 0.2924 0.3077 1.6877 0.9579 0.9095 0.0002 0.0925 0.5479 0.0032 2.7443 0.0453 3.6878 0.7129 5.0485 2.2080 1.3785 0.0110 8.2232 11.2814 17.7111 48.2221 67.7421 25.9074 23.8316 27.7915 0.0393 66.0186 83.7358 63.4109 13.6485 17.1170 19.9435 11.1363 0.2330 11.0412 90.2072 56.4966 1.0212 23.7499 52.7009 26.3799 198.9890 5.0536 6.9316 65.9247 46.1589 2.0091 30.2830 15.4543 8.9974 6.5255 0.6482 0.1369 22.5223
temp: 298.150 k
press: 1.00000 atm
elementType: 35 35 35 8 6 6 6 6 6 6 6 6 6 1 1 1 1 1 1 1
symmnumber: 1
zpe: 345000.9 jmol-1
zpe.correction: 0.131404 hartree
zpe.thermalcorrener: 0.145578 hartree
zpe.thermalcorrenthalpy: 0.146522 hartree
zpe.thermalcorrgfe: 0.085950 hartree
zpe.sumelectzpe: -461.762227 hartree
zpe.sumelectthermal: -461.748053 hartree
zpe.sumelectthermalent: -461.747109 hartree
zpe.sumelectthermalfe: -461.807681 hartree
dipole: -0.8504 0.1053 1.7888
dipole: 1.9835
quadrupole: -95.8625 -100.4877 -107.0348
quadrupole: -0.1619 -4.4937 -1.4339
quadrupole: 5.2658 0.6406 -5.9065 -0.1619 -4.4937 -1.4339
hfenergy: -461.8936308 hartree
pointgroup: C01 [X(C9H7Br3O1)]
dipole: -0.367878 -0.0425704 -0.6868869 debye
dipolederiv: -0.1809033 0.262317 0.0386885 0.2621586 -0.5148385 -0.0659739 0.0129759 -0.0385342 -0.0045211 -0.1763797 -0.2507698 0.0314732 -0.2562034 -0.5391163 0.0542571 0.0074418 0.0392531 -0.0069167 -0.7561426 -0.010404 0.0914478 -0.0147447 -0.0642232 0.0011266 0.1095219 0.0009187 -0.0244442 -1.6839204 0.004038 -0.1719554 -0.0842573 -0.3024295 -0.0104511 -0.2029391 -0.0036667 -0.3306234 1.1004731 0.0091514 0.0712511 0.0102202 -0.3991697 0.0000014 -0.2732106 0.0003562 0.0535689 0.2046291 -0.3951296 -0.1198699 -0.4528808 0.9034772 0.1180578 -0.0508224 0.0569534 -0.1149184 0.2028972 0.3730924 -0.1096897 0.4462422 0.9385382 -0.0975632 -0.0287965 -0.0534393 -0.1170569 -0.5206819 0.1477835 0.0655709 0.1407776 -0.2438465 -0.0355375 0.0670308 -0.0175529 -0.0351998 -0.5142788 -0.1486841 0.05981 -0.1653985 -0.2605503 0.0316787 0.0643897 0.0172377 -0.0353461 1.3123027 0.0172471 -0.1916882 0.0292305 0.1569464 -0.0004041 -0.2122071 -0.0006056 -0.1070558 1.0071191 -0.0487681 0.2240339 0.1047678 0.2929706 0.0466394 0.6271313 0.0471582 0.4554424 -0.0136454 -0.0217561 -0.0690528 0.0198747 0.0339458 -0.1415908 -0.1367516 -0.1400493 -0.1163467 -0.1130003 0.0422466 -0.0822886 -0.0308924 -0.0401902 -0.2094826 -0.1018588 -0.1841455 -0.2332211 0.0755285 -0.0382369 0.0089395 -0.0417655 0.031011 0.0044815 0.0129134 0.0025915 0.1600793 0.0739307 0.0405329 0.0104398 0.0432901 0.0342169 -0.0061555 0.0132802 -0.0047478 0.1601693 0.0016629 -0.0092577 -0.02475 0.009792 -0.0680243 0.1185264 -0.0609203 0.0475698 -0.006402 -0.0959724 0.0746831 0.0492258 0.0100702 -0.0110616 -0.1189243 -0.0542752 -0.0510472 -0.0253253 0.0743543 0.0239177 0.0136507 -0.0008365 -0.021008 0.1166032 0.0902909 0.0996818 0.0861174 -0.0935478 -0.0328522 0.0633762 -0.0281116 0.0950771 0.0664145 0.0924394 0.0563366 0.1416721 0.0955748 -0.0391514 0.0413871 -0.0013332 -0.0217251 0.1282962 0.0243664 0.1257316 0.100328 unknown
polarizability: 225.4204663|-6.1580844|173.0965568|-10.6271629|-3.472694|61.2803586 unknown
InChI: InChI=1S/C9H7Br3O/c1-2-3-13-9-7(11)4-6(10)5-8(9)12/h2,4-5H,1,3H2
charge 0 multiplicity 1
20 atoms
Br -0.308929 2.913953 0.337437
Br -0.19722 -2.908587 0.297977
Br 4.703208 0.103198 -0.424985
O  -1.403723 -0.018732 0.557108
C  -0.039849 0.008111 0.263992
C  0.670909 1.235392 0.166382
C  0.717342 -1.189949 0.145987
C  2.06581 1.281958 -0.033648
C  2.112452 -1.181595 -0.056618
C  2.76679 0.063989 -0.145657
C  -2.323147 -0.065033 -0.636646
C  -3.695003 -0.400898 -0.126058
C  -4.79923 0.338162 -0.393392
H  2.586183 2.239847 -0.098972
H  2.668481 -2.117993 -0.138308
H  -2.299902 0.917223 -1.144839
H  -1.946787 -0.849586 -1.324347
H  -3.762939 -1.316884 0.475938
H  -5.789349 0.036869 -0.035071
H  -4.745597 1.264354 -0.979179
