program: Gaussian 09
title: 000076744
version: EM64L-G09RevD.01
frameworkgroup: C1[X(C12H11N)]
method: RPBEPBE
basis: SDD
operation: Freq
keyword: #pfreq=noraman
keyword: PBEPBE/SDD
title: #p freq=noraman PBEPBE/SDD
converged: YES YES NO NO
title: Mulliken charges:
elementType: N C C C C C C C C C C C C H H H H H H H H H H H
charge: -0.028470 0.301580 0.259094 -0.312016 0.158022 -0.512617 -0.383932 -0.383926 -0.285313 -0.215932 -0.215931 -0.238731 -0.772325 0.253645 0.258964 0.244410 0.244410 0.234881 0.228053 0.228053 0.229977 0.254492 0.226810 0.226803
chargesum: 0.00000
title: Mulliken charges with hydrogens summed into heavy atoms:
elementType: N C C C C C C C C C C C C
charge: -0.028470 0.301580 0.259094 -0.058371 0.158022 -0.253654 -0.139522 -0.139516 -0.050432 0.012121 0.012122 -0.008755 -0.064219
polarizability: 1.98364324e+02 -1.87831325e-02 1.00980463e+02 3.68944484e+00 2.19986682e-02 9.40878445e+01
1716.lowfreq: -63.5981 -17.8552 -8.6335 -6.8185 0.0003 0.0006 0.0009 9.9976 62.1171
frequency: -63.5975 -17.7507 62.1104 79.1170 176.5583 267.7865 274.1038 358.2157 374.8520 397.4461 407.3150 533.8156 544.6145 569.2761 616.3052 632.9179 701.2995 705.5700 751.0034 768.1170 810.3474 843.6014 852.4789 919.5303 930.3672 971.9360 974.0907 976.4154 984.0780 988.8233 995.4736 1020.4344 1047.4439 1048.6393 1077.1007 1136.3865 1172.1910 1187.0746 1244.9277 1284.8251 1296.1015 1301.5809 1309.9663 1350.2230 1368.7255 1390.3478 1428.0097 1450.3047 1467.5176 1470.6049 1494.8983 1542.3996 1583.2705 1590.9743 1613.2805 2982.5886 3060.4231 3116.4403 3122.8442 3125.9929 3128.5673 3131.3119 3140.5049 3149.6335 3154.5059 3164.6528
redmass: 4.0405 1.0366 3.7849 4.3690 3.8643 3.7075 6.0132 2.7791 3.5818 2.8331 3.1899 3.2985 3.3944 5.9779 6.2423 7.3237 5.4654 1.7152 3.0488 1.9375 5.4403 1.4381 1.2433 1.4034 1.4318 2.4717 1.3842 1.3369 2.5714 5.3127 1.3118 2.7939 2.0214 1.5906 1.6025 1.3096 1.0528 1.1150 3.0170 2.2199 2.5540 3.3825 1.3692 2.1771 6.7787 1.2532 2.2131 1.3868 1.6525 1.0466 2.8321 4.9784 6.0063 6.3832 6.2984 1.0381 1.0973 1.0981 1.0845 1.0919 1.0878 1.0883 1.0925 1.0969 1.0981 1.1018
irintensity: 0.7885 0.3199 0.3757 0.8344 0.5369 0.0060 0.1230 2.8599 0.3441 0.0255 7.2814 19.4707 7.8656 0.4533 0.0074 0.7253 3.4621 54.2263 4.6545 43.2104 0.0722 28.0451 0.1627 1.3393 2.1404 15.9578 0.0004 0.0802 2.0697 3.8523 0.1462 4.2907 5.0838 9.2923 7.5613 9.1285 0.0308 0.7037 3.1475 1.3614 5.2486 0.2022 0.5608 14.6868 0.1220 20.0655 7.5345 44.2132 55.6093 15.3003 5.5537 13.3051 1.5089 18.5412 12.1391 24.2166 20.5107 9.6860 2.3840 16.4031 0.1477 11.2078 15.9890 38.6308 13.5802 22.6783
temp: 298.150 k
press: 1.00000 atm
elementType: 7 6 6 6 6 6 6 6 6 6 6 6 6 1 1 1 1 1 1 1 1 1 1 1
symmnumber: 1
zpe: 506153.5 jmol-1
zpe.correction: 0.192784 hartree
zpe.thermalcorrener: 0.202136 hartree
zpe.thermalcorrenthalpy: 0.203080 hartree
zpe.thermalcorrgfe: 0.157447 hartree
zpe.sumelectzpe: -517.724240 hartree
zpe.sumelectthermal: -517.714888 hartree
zpe.sumelectthermalent: -517.713944 hartree
zpe.sumelectthermalfe: -517.759577 hartree
dipole: -0.8728 -0.0110 2.0979
dipole: 2.2723
quadrupole: -66.4829 -72.6326 -78.9785
quadrupole: -0.0362 6.8910 0.0304
quadrupole: 6.2151 0.0654 -6.2805 -0.0362 6.8910 0.0304
hfenergy: -517.9170238 hartree
pointgroup: C01 [X(C12H11N1)]
dipole: -0.348518 0.0025168 -0.8232503 debye
dipolederiv: -0.622281 0.0000822 -0.0262189 -0.0001143 -0.2400958 0.0002417 0.044791 0.0002383 -0.3179685 0.1886582 0.0001737 -0.0543349 -0.0002024 -0.0319682 0.000477 0.0657342 0.0005069 -0.1947288 0.398594 0.0000012 0.0010068 0.0001541 0.0039218 0.0002443 -0.0464756 0.000236 -0.0740715 0.0422392 0.0000037 0.003767 0.0001797 -0.102991 -0.0008083 -0.050176 -0.0008129 0.159767 0.8242298 0.0000612 -0.0246755 -0.0003403 0.015754 -0.0002233 0.0941351 -0.0002085 0.0877921 0.0747944 -0.0001316 0.0364096 0.0000925 -0.0581181 -0.0011415 -0.044946 -0.0011589 0.3189554 -0.2001648 0.06999 -0.0001714 0.0243548 0.0555764 0.0042888 0.0086098 0.001765 -0.1287456 -0.2001578 -0.0699908 -0.000549 -0.024411 0.0556079 -0.0032547 0.0084327 -0.0007625 -0.1287734 -0.3898102 0.0001555 -0.0530929 0.0007953 -0.1316236 -0.0004133 -0.2556037 -0.0004294 0.0058354 -0.0112952 -0.0712195 -0.0021006 -0.0550844 0.0868381 0.0028553 0.0012689 0.0035978 -0.1451231 -0.0113109 0.0712264 -0.0017151 0.0550783 0.086867 -0.0015902 0.0016598 -0.0022886 -0.1451525 0.0788995 0.0000236 -0.0068341 0.0000238 -0.079052 0.0002481 -0.0085471 0.0002386 -0.166759 -0.3135377 -0.0000154 0.0076385 -0.0001823 0.0620168 0.0000495 0.0842217 0.0000456 0.041699 0.0617536 0.0002902 -0.0941108 0.0002677 0.1255508 0.0004739 -0.0904081 0.0004688 -0.0264413 0.0356732 -0.0002728 0.0888907 -0.0003339 0.1121294 0.0004362 0.1107383 0.0004383 -0.0302356 0.0570153 -0.0963959 0.001211 -0.0925034 -0.0398015 0.0018922 -0.0008504 0.0013427 0.1372951 0.0570064 0.0963899 0.0017252 0.0925073 -0.0397696 -0.0028826 -0.000357 -0.0023026 0.1372718 0.0032341 -0.0002942 0.0964041 -0.0003624 0.1495364 0.0006184 0.1158252 0.0006133 -0.0498198 0.0012399 0.0880264 0.004073 0.1086841 -0.0722729 -0.003438 0.0039141 -0.0033155 0.15384 0.0012437 -0.0880482 0.0035934 -0.1086986 -0.0723058 0.0021925 0.0033072 0.0020507 0.1538709 -0.1465281 -0.0000257 0.0075367 -0.000027 0.087266 -0.000205 0.0067199 -0.0002062 0.162423 0.0833314 0.0000469 -0.0151772 0.0003433 0.116426 0.0005446 -0.1224955 0.0005426 -0.0706438 -0.0064115 0.0453769 0.0134918 0.1076706 -0.0442074 -0.0844854 0.035561 -0.1032143 0.059319 -0.0064156 -0.0454538 0.0132325 -0.1078918 -0.0452846 0.0838797 0.0349405 0.1026146 0.0603943 unknown
polarizability: 198.3145114|0.0126719|100.9805267|-4.3363616|0.0066781|94.1375936 unknown
InChI: InChI=1S/C12H11N/c1-10-7-8-12(9-13-10)11-5-3-2-4-6-11/h2-9H,1H3
charge 0 multiplicity 1
24 atoms
N  2.478456 -0.003632 1.187949
C  0.352919 0.000197 -0.052087
C  -1.145538 0.000092 -0.020395
C  1.078487 0.003975 -1.272227
C  3.167052 0.000027 0.003165
C  1.113783 -0.003504 1.145122
C  -1.867787 1.222181 0.000929
C  -1.867742 -1.222128 -0.005759
C  2.487929 0.003887 -1.24491
C  -3.28091 1.222047 0.033789
C  -3.280858 -1.222225 0.027103
C  -3.992025 -0.000143 0.046388
C  4.679863 -0.00026 0.084393
H  0.539514 0.006924 -2.226066
H  0.606899 -0.006495 2.117606
H  -1.319053 2.170953 -0.006445
H  -1.318965 -2.170822 -0.018335
H  3.063822 0.006762 -2.176768
H  -3.824406 2.173521 0.050789
H  -3.824332 -2.17379 0.038871
H  -5.087503 -0.000245 0.07255
H  4.990125 -0.003341 1.140718
H  5.10895 -0.889401 -0.414472
H  5.109021 0.891719 -0.40931
