program: Orca
programVersion: 6.0.1
elementType: C C C C H H C H H C C H H Rh C C C C C C H H H C H H H C H H H C H H H C H H H B C C C C C C C C C C C C F F F F F F F F F F H H H
elementType: Rh
charge: 0
multiplicity: 1
keywords: r2scan0 d4 ma-def2-qzvp SP TIGHTSCF AIM NBO SMD(toluene)
formula: C29H24BF10Rh
InChI: InChI=1/C19H9BF9.C10H15.FH.Rh/c21-10-5-9(12(22)16(26)13(10)23)20(8-4-6-1-2-7(8)3-6)11-14(24)17(27)19(29)18(28)15(11)25;1-6-7(2)9(4)10(5)8(6)3;;/h1-2,6-8H,3-4H2;1-5H3;1H;/q;;;+1/p-1/rC29H24BF10Rh/c1-24-25(2)27(4)28(5)26(24,3)41(24,25,27,28,40)23-21(38)19(36)20(37)22(39)29(23,41)30(12-9-10-6-7-11(12)8-10)13-14(31)16(33)18(35)17(34)15(13)32/h6-7,10-12H,8-9H2,1-5H3
65 atoms
C  1.098892 -4.894827 0.510719
C  1.368551 -4.027878 1.72274
C  -0.541151 -3.297774 0.788156
C  -0.04166 -4.463588 -0.042519
H  1.783039 -5.635563 0.110468
H  -0.468669 -4.781163 -0.98918
C  -0.067651 -3.73548 2.188576
H  -0.119348 -2.942879 2.940641
H  -0.592036 -4.629183 2.541139
C  1.76804 -2.620015 1.174368
C  0.463676 -2.115703 0.448116
H  2.066839 -4.426356 2.462693
H  -1.592663 -3.041685 0.684048
Rh -1.607961 0.59314 -0.498276
C  -3.068695 -0.881606 -1.488291
C  -2.066751 -0.347433 -2.382526
C  -3.755356 0.226735 -0.939993
C  -2.276811 1.091047 -2.51908
C  -3.294827 1.456828 -1.599644
C  -3.361952 -2.324981 -1.258508
H  -3.726351 -2.512547 -0.245961
H  -4.134814 -2.666457 -1.960367
H  -2.478366 -2.946712 -1.418254
C  -1.112181 -1.160446 -3.188865
H  -0.215102 -0.590659 -3.444023
H  -0.800993 -2.056613 -2.645846
H  -1.584597 -1.481782 -4.126722
C  -1.542901 1.989249 -3.456558
H  -0.498116 1.684444 -3.564795
H  -2.00013 1.960292 -4.453982
H  -1.555885 3.025036 -3.109064
C  -3.86907 2.810868 -1.359406
H  -4.062689 2.968864 -0.295081
H  -3.188846 3.598079 -1.691347
H  -4.819828 2.929044 -1.896176
C  -4.827833 0.199227 0.093328
H  -4.928317 -0.78825 0.545273
H  -4.619346 0.91824 0.892441
H  -5.789595 0.476666 -0.356918
B  -0.003561 -0.664275 0.890495
C  0.565911 0.612773 0.13001
C  -0.170988 1.804898 -0.023436
C  1.877124 0.68538 -0.406357
C  0.332786 3.033936 -0.412844
C  2.429842 1.889118 -0.784413
C  1.652627 3.066018 -0.801801
C  -0.55903 -0.427061 2.361146
C  0.256666 0.18286 3.309026
C  -1.825713 -0.781911 2.807615
C  -0.14214 0.426339 4.615754
C  -2.273109 -0.545369 4.097566
C  -1.420592 0.058358 5.012823
F  -2.711314 -1.343581 1.953318
F  -3.514102 -0.888001 4.467937
F  -1.828874 0.284099 6.264168
F  0.685963 1.004341 5.492989
F  1.506512 0.560494 2.969292
F  2.695082 -0.373916 -0.379896
F  3.722553 1.976257 -1.118625
F  2.18926 4.173909 -1.312384
F  -0.463918 4.093183 -0.614682
F  -1.546801 1.807363 1.320814
H  0.643706 -2.120281 -0.635374
H  2.618655 -2.673507 0.492159
H  2.050007 -1.966747 2.009264
elementType: C H Rh B F
totalener: -2252.95493880942740 hartree
nucrepener: 5832.21243945218885 hartree
electener: -8085.14309923308610 hartree
twoeener: 6674.94331001929640 hartree
cpcmener: -0.01615178970926 hartree
kineticenergy: 2173.58636235014274 hartree
exchangeener: -206.569159493606 hartree
energy: -680.0899 -679.8052 -679.7670 -679.7218 -679.7104 -679.6710 -679.6344 -679.4697 -679.3971 -676.5638 -284.9986 -284.8054 -284.5206 -284.4713 -284.4706 -284.2962 -284.2933 -284.2384 -284.2283 -283.6438 -282.7308 -282.6524 -282.5754 -282.4769 -282.3936 -282.2674 -281.7618 -281.5220 -281.5012 -281.4047 -281.3990 -281.3761 -281.3328 -281.2697 -281.0857 -281.0294 -280.9906 -280.8980 -280.8594 -187.3167 -91.6600 -57.5097 -56.8291 -56.6021 -36.6660 -36.3886 -36.3281 -36.1348 -36.0458 -35.9604 -35.9429 -35.6909 -35.6513 -31.3813 -26.4381 -26.0330 -25.7404 -25.3053 -23.1158 -23.0604 -22.9408 -22.6053 -22.4825 -22.3097 -21.3032 -21.2244 -21.1555 -20.9661 -20.5874 -20.0397 -19.4538 -19.1658 -19.0315 -18.9598 -18.6154 -18.3571 -17.2841 -17.1011 -16.8952 -16.8382 -16.8213 -16.5500 -16.5241 -15.9929 -15.8506 -15.6086 -15.5051 -15.4305 -15.4129 -15.3127 -15.2087 -15.1209 -14.8472 -14.7877 -14.6756 -14.4971 -14.3597 -14.2004 -14.0781 -14.0259 -13.9246 -13.7696 -13.6759 -13.6095 -13.5457 -13.4927 -13.2474 -13.0052 -12.9528 -12.9360 -12.8393 -12.7444 -12.6997 -12.5799 -12.5003 -12.3571 -12.1145 -11.9922 -11.9114 -11.7967 -11.7763 -11.7171 -11.6520 -11.6252 -11.5402 -11.3451 -11.2499 -11.2140 -11.1655 -11.1050 -10.9737 -10.8268 -10.5118 -10.4208 -10.2589 -10.2238 -10.1891 -10.0219 -9.8168 -9.6717 -9.5743 -9.3873 -9.2919 -9.0698 -8.5473 -8.3719 -8.2785 -7.9690 -7.8348 -7.7466 -7.3213 -7.2964 -7.1382 -6.9273 -5.9145 -2.6528 -1.9361 -0.8564 -0.5979 -0.1948 -0.0871 -0.0093 0.0774 0.1363 0.2629 0.3792 electronvolt
chargesum: -0.0000000
charge: -0.048486 -0.072235 0.003324 -0.305917 0.057265 0.045124 0.016763 0.025145 0.017423 -0.067617 0.100076 0.031008 0.093183 0.854907 -0.002591 -0.022481 -0.093191 -0.063834 -0.107416 -0.125160 0.025549 0.041821 0.029633 -0.153271 0.051123 0.038948 0.056874 -0.125691 0.046305 0.053558 0.045230 -0.152973 0.051376 0.039229 0.051774 -0.147544 0.047243 0.064313 0.047396 0.534956 -0.641930 0.583698 0.294774 0.013273 0.083864 0.249996 0.109133 0.517184 0.432766 -0.076501 -0.128666 0.381517 -0.263635 -0.290848 -0.258020 -0.270594 -0.294379 -0.294185 -0.265790 -0.229517 -0.250543 -0.533931 0.071665 0.035770 0.043761
charge: 0.072541 -0.054206 -0.047017 0.060469 -0.040117 -0.037856 0.117815 -0.002658 -0.007801 0.145559 0.059154 -0.017971 -0.010632 0.636718 -0.151904 -0.161961 -0.144653 -0.157343 -0.150636 0.227604 -0.012017 -0.014008 -0.014850 0.234606 -0.010845 -0.011559 -0.010093 0.238463 -0.010713 -0.013936 -0.010739 0.236584 -0.007744 -0.013887 -0.015645 0.244486 -0.012590 -0.001910 -0.011396 -0.553150 -0.019365 -0.161836 -0.352612 -0.397578 -0.372634 -0.361496 0.017634 -0.354799 -0.369223 -0.373152 -0.377537 -0.372119 0.302265 0.356614 0.366561 0.360417 0.340801 0.351925 0.360424 0.379704 0.342204 -0.243898 0.020916 -0.012249 0.004871
qa: -0.0485 -0.0722 0.0033 -0.3059 0.0573 0.0451 0.0168 0.0251 0.0174 -0.0676 0.1001 0.0310 0.0932 0.8549 -0.0026 -0.0225 -0.0932 -0.0638 -0.1074 -0.1252 0.0255 0.0418 0.0296 -0.1533 0.0511 0.0389 0.0569 -0.1257 0.0463 0.0536 0.0452 -0.1530 0.0514 0.0392 0.0518 -0.1475 0.0472 0.0643 0.0474 0.5350 -0.6419 0.5837 0.2948 0.0133 0.0839 0.2500 0.1091 0.5172 0.4328 -0.0765 -0.1287 0.3815 -0.2636 -0.2908 -0.2580 -0.2706 -0.2944 -0.2942 -0.2658 -0.2295 -0.2505 -0.5339 0.0717 0.0358 0.0438
va: 3.6630 3.7694 3.7027 3.7047 1.0169 1.0315 3.6562 1.0407 1.0096 3.6454 2.9092 1.0168 0.9662 4.5601 3.1788 3.2987 3.5315 3.3420 3.3980 3.7522 0.9990 0.9973 1.0013 3.8034 0.9911 0.9982 0.9951 3.7768 0.9817 0.9968 0.9930 3.8102 0.9978 1.0013 0.9960 3.7819 0.9964 0.9939 0.9950 2.2670 3.4233 2.7261 3.2661 3.4498 3.5413 3.5671 2.9307 2.8064 3.1099 3.6992 3.7900 3.3347 0.7660 0.9125 0.8888 0.9033 0.8019 0.8746 0.9002 0.9258 0.8870 0.5442 0.8702 0.9848 0.9753
dispersion: -0.043761273 hartree
energy: -2252.998700082433 hartree
dipole: 30.692587646 -32.492612049 -1.800024403 -67.114689709 66.212445389 -0.902244320 28.513827836 -31.958015956 -3.444188120
dipolemethod: SCF
magnitude: 3.989556927 au
magnitude: 10.140647817 debye
