program: Orca
programVersion: 6.0.1
elementType: C C C C H H C H H C C H H Rh C C C C C C H H H C H H H C H H H C H H H C H H H B C C C C C C C C C C C C F F F F F F F F F F H H H
elementType: Rh
charge: 0
multiplicity: 1
keywords: OPT FREQ r2scan-3c
frequency: 0.00 0.00 0.00 0.00 0.00 0.00 10.94 22.48 27.36 35.47 38.37 50.54 60.96 67.59 74.56 80.63 86.63 97.45 106.74 115.93 122.12 126.39 133.39 135.52 141.07 144.55 150.01 153.45 157.00 164.00 169.78 173.18 187.56 189.97 193.95 214.81 218.42 224.92 235.38 235.98 251.37 279.44 280.22 285.18 286.80 293.44 305.00 308.44 309.65 319.00 340.12 346.62 359.17 369.30 383.20 385.75 390.81 396.03 434.33 450.34 458.03 460.71 469.95 488.99 493.61 515.25 523.36 532.27 538.23 540.81 557.88 566.68 583.45 587.71 615.35 616.88 623.95 633.97 647.13 655.91 661.71 666.89 672.31 707.04 708.75 736.49 765.22 785.61 793.98 796.07 804.13 806.47 831.15 843.35 867.07 903.10 916.80 928.87 941.98 952.67 956.99 958.13 979.20 983.46 985.50 1012.73 1028.51 1033.45 1036.30 1042.62 1048.84 1052.21 1057.92 1065.20 1086.53 1093.07 1104.52 1113.93 1118.60 1133.35 1144.43 1151.33 1161.11 1167.42 1170.00 1174.26 1186.47 1216.99 1248.18 1268.09 1271.49 1280.93 1292.81 1297.69 1317.20 1325.80 1332.44 1347.70 1351.17 1365.00 1371.54 1395.01 1404.23 1405.80 1409.30 1410.27 1413.39 1416.42 1419.19 1452.11 1457.49 1460.07 1464.14 1470.10 1470.51 1472.62 1475.33 1481.70 1483.89 1488.96 1490.55 1493.35 1495.13 1510.95 1530.74 1560.71 1598.94 1618.14 1634.14 1640.56 1669.46 2719.74 3005.56 3006.81 3011.00 3013.60 3013.98 3034.61 3050.37 3079.85 3083.18 3087.14 3088.10 3092.65 3094.29 3099.91 3114.66 3122.07 3123.90 3128.79 3131.80 3133.75 3151.04 3182.64 3223.41
frequency: 10.94 22.48 27.36 35.47 38.37 50.54 60.96 67.59 74.56 80.63 86.63 97.45 106.74 115.93 122.12 126.39 133.39 135.52 141.07 144.55 150.01 153.45 157.00 164.00 169.78 173.18 187.56 189.97 193.95 214.81 218.42 224.92 235.38 235.98 251.37 279.44 280.22 285.18 286.80 293.44 305.00 308.44 309.65 319.00 340.12 346.62 359.17 369.30 383.20 385.75 390.81 396.03 434.33 450.34 458.03 460.71 469.95 488.99 493.61 515.25 523.36 532.27 538.23 540.81 557.88 566.68 583.45 587.71 615.35 616.88 623.95 633.97 647.13 655.91 661.71 666.89 672.31 707.04 708.75 736.49 765.22 785.61 793.98 796.07 804.13 806.47 831.15 843.35 867.07 903.10 916.80 928.87 941.98 952.67 956.99 958.13 979.20 983.46 985.50 1012.73 1028.51 1033.45 1036.30 1042.62 1048.84 1052.21 1057.92 1065.20 1086.53 1093.07 1104.52 1113.93 1118.60 1133.35 1144.43 1151.33 1161.11 1167.42 1170.00 1174.26 1186.47 1216.99 1248.18 1268.09 1271.49 1280.93 1292.81 1297.69 1317.20 1325.80 1332.44 1347.70 1351.17 1365.00 1371.54 1395.01 1404.23 1405.80 1409.30 1410.27 1413.39 1416.42 1419.19 1452.11 1457.49 1460.07 1464.14 1470.10 1470.51 1472.62 1475.33 1481.70 1483.89 1488.96 1490.55 1493.35 1495.13 1510.95 1530.74 1560.71 1598.94 1618.14 1634.14 1640.56 1669.46 2719.74 3005.56 3006.81 3011.00 3013.60 3013.98 3034.61 3050.37 3079.85 3083.18 3087.14 3088.10 3092.65 3094.29 3099.91 3114.66 3122.07 3123.90 3128.79 3131.80 3133.75 3151.04 3182.64 3223.41
formula: C29H24BF10Rh
InChI: InChI=1/C19H9BF9.C10H15.FH.Rh/c21-10-5-9(12(22)16(26)13(10)23)20(8-4-6-1-2-7(8)3-6)11-14(24)17(27)19(29)18(28)15(11)25;1-6-7(2)9(4)10(5)8(6)3;;/h1-2,6-8H,3-4H2;1-5H3;1H;/q;;;+1/p-1/rC29H24BF10Rh/c1-25-26(2)28(4)29(5)27(25,3)41(25,26,28,29,40)24-14(17(33)20(36)22(38)23(24)39)30(12-9-10-6-7-11(12)8-10)13-15(31)18(34)21(37)19(35)16(13)32/h6-7,10-12H,8-9H2,1-5H3
65 atoms
C  -2.910389 -1.284287 3.301802
C  -1.985732 -2.449735 3.020166
C  -0.762043 -0.560839 2.883889
C  -2.18633 -0.161155 3.216476
H  -3.984693 -1.362714 3.435148
H  -2.520852 0.868966 3.237751
C  -0.670688 -1.912131 3.616499
H  0.203173 -2.513383 3.346667
H  -0.720401 -1.788483 4.702353
C  -1.631281 -2.383905 1.497464
C  -0.839589 -1.05174 1.357386
H  -2.322735 -3.43467 3.351778
H  0.001884 0.193206 3.074301
Rh -1.548747 1.546791 0.023531
C  -2.587407 0.580031 -1.605566
C  -1.9466 1.762315 -2.06984
C  -3.638191 0.973176 -0.649074
C  -2.500685 2.875048 -1.312195
C  -3.590471 2.362477 -0.481381
C  -2.352659 -0.805767 -2.102665
H  -2.621763 -1.55313 -1.352074
H  -2.957647 -1.000103 -2.998238
H  -1.30265 -0.959771 -2.364597
C  -0.925345 1.854256 -3.150692
H  -0.266447 2.71303 -3.005026
H  -0.304376 0.955743 -3.187139
H  -1.419456 1.966663 -4.124107
C  -2.234736 4.324767 -1.510821
H  -1.332741 4.500129 -2.096002
H  -3.086533 4.7726 -2.041079
H  -2.12849 4.839229 -0.551863
C  -4.36904 3.212774 0.462196
H  -5.121057 2.634626 1.002063
H  -3.694751 3.662054 1.201377
H  -4.878131 4.02318 -0.071978
C  -4.54668 0.00789 0.028444
H  -3.98356 -0.789702 0.522485
H  -5.157905 0.496569 0.7887
H  -5.212758 -0.461148 -0.706612
B  0.593719 -1.061494 0.708606
C  1.217606 0.204599 0.068295
C  0.473728 1.41259 -0.127402
C  2.594593 0.244946 -0.238501
C  1.156564 2.554312 -0.497507
C  3.249797 1.39701 -0.635059
C  2.521411 2.571632 -0.752446
C  1.427164 -2.406262 0.82772
C  1.224826 -3.434701 -0.078226
C  2.367298 -2.638142 1.820928
C  1.912945 -4.639004 -0.022673
C  3.072966 -3.8279 1.923619
C  2.843262 -4.834384 0.990952
F  2.62224 -1.668784 2.720321
F  3.971675 -4.015969 2.894146
F  3.515286 -5.984502 1.069361
F  1.693103 -5.602977 -0.922833
F  0.324416 -3.26161 -1.073152
F  3.372014 -0.850624 -0.157608
F  4.56076 1.392323 -0.902637
F  3.138008 3.693916 -1.126821
F  0.514417 3.736468 -0.663131
F  -1.304849 2.361013 1.810275
H  -1.48933 -0.314715 0.822186
H  -2.525896 -2.418643 0.866527
H  -1.013636 -3.246684 1.227658
totalener: -2253.14137995160763 hartree
nucrepener: 5740.31682948478283 hartree
electener: -7993.45820943639046 hartree
twoeener: 6583.02299012000731 hartree
kineticenergy: 2174.78866327613514 hartree
exchangeener: -275.468465848186 hartree
correlationener: -10.491275327040 hartree
xcener: -285.959741175226 hartree
dispersion: -0.040387429 hartree
dispersion: -0.040310376 hartree
dispersion: -0.040285292 hartree
dispersion: -0.040203939 hartree
dispersion: -0.040095678 hartree
dispersion: -0.040121657 hartree
dispersion: -0.040135457 hartree
dispersion: -0.040134268 hartree
dispersion: -0.040115249 hartree
dispersion: -0.040107268 hartree
dispersion: -0.040078705 hartree
dispersion: -0.040046835 hartree
dispersion: -0.039996803 hartree
dispersion: -0.039988228 hartree
dispersion: -0.039971464 hartree
dispersion: -0.039964505 hartree
dispersion: -0.039950703 hartree
dispersion: -0.039944485 hartree
dispersion: -0.039933984 hartree
dispersion: -0.039937124 hartree
dispersion: -0.039935912 hartree
dispersion: -0.039938543 hartree
dispersion: -0.039931355 hartree
dispersion: -0.039925522 hartree
dispersion: -0.039904926 hartree
dispersion: -0.039879694 hartree
dispersion: -0.039840681 hartree
dispersion: -0.039822317 hartree
dispersion: -0.039784751 hartree
dispersion: -0.039787639 hartree
dispersion: -0.039800956 hartree
dispersion: -0.039832745 hartree
dispersion: -0.039886749 hartree
dispersion: -0.039951492 hartree
dispersion: -0.040070425 hartree
dispersion: -0.040126115 hartree
dispersion: -0.040174755 hartree
dispersion: -0.040194051 hartree
dispersion: -0.040218262 hartree
dispersion: -0.040278062 hartree
dispersion: -0.040210354 hartree
dispersion: -0.040222949 hartree
dispersion: -0.040256000 hartree
dispersion: -0.040331545 hartree
dispersion: -0.040393174 hartree
dispersion: -0.040431749 hartree
dispersion: -0.040447626 hartree
dispersion: -0.040456574 hartree
dispersion: -0.040449760 hartree
dispersion: -0.040452394 hartree
dispersion: -0.040441503 hartree
dispersion: -0.040436847 hartree
dispersion: -0.040437194 hartree
dispersion: -0.040431664 hartree
dispersion: -0.040427252 hartree
dispersion: -0.040420194 hartree
dispersion: -0.040414157 hartree
dispersion: -0.040408677 hartree
dispersion: -0.040404973 hartree
dispersion: -0.040401903 hartree
dispersion: -0.040399186 hartree
energy: -667.4369 -667.3739 -667.3446 -667.3039 -667.2914 -667.1412 -667.1317 -667.0137 -666.7759 -663.3012 -276.2247 -276.1068 -276.0839 -276.0697 -276.0692 -276.0224 -275.9074 -275.7883 -275.5108 -274.9638 -274.8121 -274.7491 -274.7379 -274.5492 -273.8015 -273.7445 -273.7182 -273.6961 -273.6159 -273.6093 -273.5999 -273.4634 -273.3899 -273.3533 -273.2973 -273.2795 -272.9508 -272.8769 -272.8105 -180.7065 -87.7389 -54.5899 -53.7489 -53.6619 -33.3625 -33.1929 -33.1273 -32.9585 -32.8870 -32.7563 -32.6671 -32.5358 -32.3311 -27.4023 -24.5772 -23.5415 -23.2053 -23.0390 -21.4277 -21.3365 -20.5698 -20.2567 -19.9890 -19.8429 -19.6000 -19.5299 -19.4651 -19.3704 -18.7853 -18.2039 -17.3714 -17.2216 -17.0784 -16.9523 -16.8059 -16.5784 -15.4279 -15.2942 -15.0001 -14.9052 -14.8307 -14.4356 -14.3441 -14.2806 -14.2414 -14.2015 -13.9720 -13.7794 -13.5639 -13.3647 -13.2996 -13.1981 -13.0743 -12.9530 -12.8692 -12.6905 -12.5929 -12.4808 -12.4298 -12.2116 -12.0924 -12.0487 -11.7519 -11.7231 -11.6538 -11.6460 -11.5891 -11.5207 -11.4281 -11.2869 -11.0291 -10.9409 -10.9243 -10.8575 -10.8345 -10.8163 -10.7643 -10.6883 -10.6536 -10.5982 -10.4638 -10.4170 -10.2189 -10.1826 -10.0675 -10.0272 -9.7174 -9.5355 -9.4598 -9.4447 -9.4144 -9.3632 -9.2093 -9.1499 -9.0071 -8.9675 -8.8161 -8.7670 -8.6184 -8.5369 -8.3533 -8.1746 -8.0642 -8.0372 -7.5581 -7.4897 -7.0454 -6.6511 -6.4625 -6.3703 -6.2932 -6.1637 -5.9836 -5.7395 -5.4392 -3.4722 -2.6573 -1.9246 -1.2748 -1.0269 -0.7758 -0.7096 -0.5137 -0.1407 -0.0665 -0.0525 electronvolt
chargesum: -0.0000000
charge: -0.266462 0.154451 0.190970 -0.285858 0.154703 0.194242 -0.532086 0.168987 0.177057 -0.484493 -0.241298 0.164334 0.210436 -0.101071 0.301106 -0.022814 0.268100 0.378015 0.029445 -0.561357 0.164206 0.171718 0.182123 -0.603504 0.176678 0.172009 0.168439 -0.486306 0.168651 0.166246 0.188790 -0.621841 0.148172 0.216033 0.161853 -0.603188 0.184468 0.156650 0.170821 0.179774 -0.200740 0.247790 0.282746 0.139082 0.044805 0.180145 -0.095565 0.211826 0.253038 0.112060 0.132664 0.156113 -0.207795 -0.175714 -0.179643 -0.179338 -0.215347 -0.196334 -0.180212 -0.170997 -0.200669 -0.619349 0.171319 0.153643 0.178272
charge: -0.189993 -0.191144 -0.148034 -0.155791 0.165359 0.188800 -0.247321 0.171532 0.172191 -0.251476 -0.212886 0.163036 0.187070 -0.127574 -0.046612 -0.035815 -0.023230 -0.008877 -0.051233 -0.359981 0.174093 0.172341 0.179942 -0.357473 0.178062 0.177401 0.171556 -0.360113 0.176308 0.173101 0.187846 -0.361590 0.167225 0.192579 0.168658 -0.365089 0.180744 0.171714 0.173275 0.135795 -0.141485 -0.031809 0.261579 0.206894 0.218941 0.256719 -0.122586 0.228145 0.227361 0.225764 0.227591 0.236656 -0.249498 -0.239187 -0.236208 -0.242279 -0.263120 -0.251108 -0.244050 -0.233655 -0.264599 -0.455442 0.218104 0.155470 0.177403
qa: -0.2665 0.1545 0.1910 -0.2859 0.1547 0.1942 -0.5321 0.1690 0.1771 -0.4845 -0.2413 0.1643 0.2104 -0.1011 0.3011 -0.0228 0.2681 0.3780 0.0294 -0.5614 0.1642 0.1717 0.1821 -0.6035 0.1767 0.1720 0.1684 -0.4863 0.1687 0.1662 0.1888 -0.6218 0.1482 0.2160 0.1619 -0.6032 0.1845 0.1567 0.1708 0.1798 -0.2007 0.2478 0.2827 0.1391 0.0448 0.1801 -0.0956 0.2118 0.2530 0.1121 0.1327 0.1561 -0.2078 -0.1757 -0.1796 -0.1793 -0.2153 -0.1963 -0.1802 -0.1710 -0.2007 -0.6193 0.1713 0.1536 0.1783
va: 3.7636 3.3680 3.3715 3.8215 0.9721 0.9616 3.7383 0.9639 0.9564 3.7463 3.6776 0.9633 0.9466 4.4997 3.4937 4.0280 3.5458 3.4255 3.9028 3.6547 0.9595 0.9559 0.9550 3.7251 0.9575 0.9586 0.9557 3.7117 0.9627 0.9553 0.9527 3.6912 0.9661 0.9431 0.9558 3.7240 0.9527 0.9649 0.9533 3.5897 3.6271 3.1800 3.4194 3.5164 3.7240 3.6115 3.4310 3.7281 3.6864 3.6574 3.6450 3.6435 1.0009 1.0388 1.0399 1.0352 0.9976 0.9944 1.0294 1.0390 0.9902 0.5841 0.9424 0.9620 0.9593
dispersion: -0.040396908 hartree
energy: -2253.170384188049 hartree
dipole: 27.313827166 -30.624071310 -3.310244145 -87.570391150 88.030486935 0.460095785 15.011062428 -16.747331745 -1.736269316
dipolemethod: SCF
magnitude: 3.766169880 au
magnitude: 9.572843069 debye
temp: 298.15 k
press: 1.00 atm
zeropoint: 0.46506571 hartree
thermalvibcorrection: 0.03752454 hartree
thermalrotcorrection: 0.00141627 hartree
thermaltrasncorrection: 0.00141627 hartree
thermaltotal: -2252.66496139 hartree
thermalcorr: 0.04035709 hartree
nonthermalcorr: 0.46506571 hartree
totalcorr: 0.50542279 hartree
thermalcorrenthalpy: 0.00094421 hartree
totalenthalpy: -2252.66401719 hartree
vibrat: 0.06758053 hartree
rotat: 0.01799663 hartree
transl: 0.02157821 hartree
total: 0.10715537 hartree
totalentropycorr: -0.10715537 hartree
gibbsenthalpy: -2252.77117256 hartree
gibbsminuselec: 0.39921163 hartree
