program: Orca
programVersion: 6.0.1
elementType: C C C C C C C C C Rh C C C C F F F F B C C C C C C F F F F F C C C C C C C C C C F H H H H H H H H H H H H H H H H H H H H H H H H
elementType: Rh
charge: 0
multiplicity: 1
keywords: r2scan-3c OPT FREQ
frequency: 0.00 0.00 0.00 0.00 0.00 0.00 22.10 28.14 34.51 40.54 47.01 56.04 73.78 76.70 87.64 100.94 105.71 118.37 125.49 129.84 133.24 140.47 147.32 154.95 156.40 162.75 165.11 175.34 175.83 183.24 190.83 196.33 197.19 205.46 208.36 224.05 233.42 239.79 243.00 267.17 279.84 284.59 289.44 290.11 293.93 299.65 304.42 307.62 323.48 325.71 341.33 348.88 350.44 362.75 379.74 393.32 394.18 401.81 435.42 441.58 451.56 454.22 474.67 478.31 489.70 505.45 517.16 533.28 538.34 543.64 554.66 587.47 589.76 597.76 606.25 617.42 623.32 641.07 654.55 661.28 669.67 690.70 702.91 708.39 725.84 750.63 780.75 789.11 794.18 797.00 804.97 807.97 826.29 864.56 876.32 901.19 911.44 911.61 936.80 942.23 951.75 955.42 956.85 992.34 1005.20 1007.02 1026.72 1031.51 1033.87 1042.40 1047.60 1049.09 1049.91 1067.86 1086.46 1093.89 1103.79 1113.75 1119.31 1121.22 1136.44 1143.51 1157.43 1165.31 1173.79 1187.57 1200.83 1239.03 1254.24 1267.49 1272.50 1279.12 1288.01 1294.18 1306.19 1316.47 1339.12 1354.59 1357.99 1367.35 1374.29 1380.97 1395.77 1406.31 1410.12 1417.14 1420.43 1427.17 1434.47 1444.85 1449.07 1458.80 1460.54 1468.02 1470.94 1472.94 1474.56 1479.99 1482.02 1485.47 1487.04 1489.67 1490.42 1505.20 1523.38 1530.99 1611.73 1621.61 1625.02 1625.68 1645.66 3000.84 3007.26 3008.26 3009.03 3010.57 3012.13 3016.72 3035.59 3080.09 3089.97 3091.31 3093.18 3093.46 3095.09 3098.62 3108.11 3119.62 3129.87 3131.58 3136.76 3156.48 3162.97 3176.54 3201.76
frequency: 22.10 28.14 34.51 40.54 47.01 56.04 73.78 76.70 87.64 100.94 105.71 118.37 125.49 129.84 133.24 140.47 147.32 154.95 156.40 162.75 165.11 175.34 175.83 183.24 190.83 196.33 197.19 205.46 208.36 224.05 233.42 239.79 243.00 267.17 279.84 284.59 289.44 290.11 293.93 299.65 304.42 307.62 323.48 325.71 341.33 348.88 350.44 362.75 379.74 393.32 394.18 401.81 435.42 441.58 451.56 454.22 474.67 478.31 489.70 505.45 517.16 533.28 538.34 543.64 554.66 587.47 589.76 597.76 606.25 617.42 623.32 641.07 654.55 661.28 669.67 690.70 702.91 708.39 725.84 750.63 780.75 789.11 794.18 797.00 804.97 807.97 826.29 864.56 876.32 901.19 911.44 911.61 936.80 942.23 951.75 955.42 956.85 992.34 1005.20 1007.02 1026.72 1031.51 1033.87 1042.40 1047.60 1049.09 1049.91 1067.86 1086.46 1093.89 1103.79 1113.75 1119.31 1121.22 1136.44 1143.51 1157.43 1165.31 1173.79 1187.57 1200.83 1239.03 1254.24 1267.49 1272.50 1279.12 1288.01 1294.18 1306.19 1316.47 1339.12 1354.59 1357.99 1367.35 1374.29 1380.97 1395.77 1406.31 1410.12 1417.14 1420.43 1427.17 1434.47 1444.85 1449.07 1458.80 1460.54 1468.02 1470.94 1472.94 1474.56 1479.99 1482.02 1485.47 1487.04 1489.67 1490.42 1505.20 1523.38 1530.99 1611.73 1621.61 1625.02 1625.68 1645.66 3000.84 3007.26 3008.26 3009.03 3010.57 3012.13 3016.72 3035.59 3080.09 3089.97 3091.31 3093.18 3093.46 3095.09 3098.62 3108.11 3119.62 3129.87 3131.58 3136.76 3156.48 3162.97 3176.54 3201.76
formula: C29H24BF10Rh
InChI: InChI=1/C19H9BF10.C10H15.Rh/c21-10-5-9(12(22)16(26)13(10)23)20(30,8-4-6-1-2-7(8)3-6)11-14(24)17(27)19(29)18(28)15(11)25;1-6-7(2)9(4)10(5)8(6)3;/h1-2,6-8H,3-4H2;1-5H3;/rC29H24BF10Rh/c1-25-26(2)28(4)29(5)27(25,3)41(25,26,28,29)24-14(17(33)20(36)22(38)23(24)39)30(40,12-9-10-6-7-11(12)8-10)13-15(31)18(34)21(37)19(35)16(13)32/h6-7,10-12H,8-9H2,1-5H3
65 atoms
C  -2.825623 -2.882163 -0.298342
C  -1.071175 1.575546 -0.320323
C  -1.956349 0.499331 -0.077917
C  -2.047979 -2.123642 0.822866
C  2.976008 1.216442 -0.501218
C  2.986737 0.836458 0.86265
C  2.210367 2.451897 -0.656912
C  2.180122 1.800703 1.569918
C  1.771439 2.851242 0.654629
Rh 0.831207 1.01189 0.11563
C  -1.569884 2.784589 -0.764042
C  -3.31025 0.721758 -0.23282
C  -3.811804 1.95015 -0.662543
C  -2.934501 2.986249 -0.938981
F  -0.767278 3.835615 -1.067426
F  -3.405984 4.166305 -1.368241
F  -5.127254 2.136235 -0.823005
F  -4.226424 -0.243518 -0.010875
B  -1.174715 -0.857829 0.345972
C  -0.018135 -1.159736 -0.837498
C  -0.242476 -0.933536 -2.208019
C  1.153103 -1.889809 -0.559928
C  0.620866 -1.359812 -3.209935
C  2.033965 -2.333564 -1.531963
C  1.766921 -2.063944 -2.867786
F  1.457004 -2.232419 0.701297
F  -1.353081 -0.318424 -2.627664
F  0.364772 -1.103422 -4.497155
F  2.617509 -2.46401 -3.81224
F  3.149884 -3.002249 -1.203206
C  -1.284489 -3.308925 1.535136
C  -2.494379 -4.387494 -0.02751
C  -1.008682 -4.26861 0.358631
C  -3.100273 -4.720322 1.320841
C  -2.377665 -4.082798 2.249982
C  3.669248 0.544189 -1.630608
C  3.684796 -0.324407 1.486146
C  2.167569 3.243273 -1.919727
C  1.17153 4.147917 1.083827
C  1.875413 1.765899 3.024073
F  -0.294397 -0.350736 1.482034
H  4.049338 -0.441732 -1.359216
H  3.009508 0.44014 -2.497916
H  4.520511 1.160481 -1.94879
H  3.148342 3.702852 -2.102492
H  1.933849 2.606173 -2.777214
H  1.417436 4.030804 -1.875948
H  1.853961 4.643148 1.785948
H  1.003383 4.812695 0.238112
H  0.21425 4.003608 1.591922
H  2.728686 2.160201 3.592473
H  0.998418 2.372241 3.259999
H  1.688553 0.743282 3.362109
H  4.614198 0.008247 1.96603
H  3.063707 -0.797655 2.2506
H  3.940372 -1.09018 0.751154
H  -0.436229 -3.00182 2.148289
H  -2.767814 -1.715047 1.547482
H  -2.464714 -2.605667 -1.298792
H  -3.900315 -2.691569 -0.273963
H  -2.745807 -5.057389 -0.853796
H  -4.02988 -5.259918 1.468379
H  -2.604468 -3.993007 3.30766
H  -0.404866 -3.833633 -0.445011
H  -0.572845 -5.219001 0.683499
totalener: -2253.16749253785201 hartree
nucrepener: 5893.83499550946999 hartree
electener: -8147.00248804732200 hartree
twoeener: 6736.49952139695142 hartree
kineticenergy: 2175.69378316742450 hartree
exchangeener: -275.721582475435 hartree
correlationener: -10.516868355512 hartree
xcener: -286.238450830946 hartree
dispersion: -0.041256566 hartree
dispersion: -0.041091974 hartree
dispersion: -0.041041235 hartree
dispersion: -0.041070772 hartree
dispersion: -0.041090436 hartree
dispersion: -0.041111979 hartree
dispersion: -0.041152506 hartree
dispersion: -0.041168190 hartree
dispersion: -0.041165284 hartree
dispersion: -0.041144392 hartree
dispersion: -0.041139210 hartree
dispersion: -0.041158786 hartree
dispersion: -0.041195332 hartree
dispersion: -0.041230030 hartree
dispersion: -0.041245953 hartree
dispersion: -0.041249971 hartree
dispersion: -0.041226002 hartree
dispersion: -0.041240090 hartree
dispersion: -0.041249571 hartree
dispersion: -0.041263968 hartree
dispersion: -0.041271269 hartree
dispersion: -0.041276899 hartree
dispersion: -0.041276034 hartree
dispersion: -0.041274208 hartree
dispersion: -0.041269681 hartree
dispersion: -0.041265537 hartree
dispersion: -0.041263853 hartree
dispersion: -0.041268360 hartree
dispersion: -0.041273638 hartree
dispersion: -0.041277915 hartree
dispersion: -0.041278473 hartree
dispersion: -0.041275917 hartree
dispersion: -0.041274842 hartree
dispersion: -0.041270925 hartree
dispersion: -0.041268856 hartree
dispersion: -0.041263494 hartree
dispersion: -0.041263086 hartree
dispersion: -0.041260723 hartree
energy: -667.8861 -667.6967 -667.5530 -667.3171 -667.2381 -666.9134 -666.8564 -666.8249 -666.3857 -665.3154 -276.6516 -276.4178 -276.3938 -276.3187 -276.3045 -275.5681 -275.5275 -275.3912 -275.2338 -275.1864 -275.1609 -275.0394 -274.9610 -274.7027 -274.0633 -273.9249 -273.8366 -273.8073 -273.7649 -273.7559 -273.3256 -272.6852 -272.6723 -272.6151 -272.4082 -272.3472 -272.3056 -272.2776 -271.9206 -180.1863 -87.9265 -54.8434 -53.9268 -53.8173 -33.7520 -33.3961 -33.2536 -32.9401 -32.8663 -32.7948 -32.5173 -32.2678 -31.9670 -30.1322 -24.8212 -23.7442 -22.7017 -22.4798 -21.6741 -21.5027 -20.6709 -20.4922 -19.8222 -19.7218 -19.6174 -19.5406 -19.4671 -18.6436 -18.0176 -17.5771 -17.4867 -17.3797 -17.2764 -17.2035 -16.4162 -16.2331 -15.6062 -15.1996 -15.0896 -14.6840 -14.4777 -14.4407 -14.3610 -14.2001 -14.1138 -14.0214 -13.9588 -13.7761 -13.6202 -13.2186 -13.2051 -13.1385 -12.9977 -12.8619 -12.6891 -12.6409 -12.6078 -12.5714 -12.3686 -12.0908 -11.9821 -11.9382 -11.8280 -11.8102 -11.7862 -11.7344 -11.5602 -11.5498 -11.3638 -11.2286 -11.1854 -11.0759 -11.0221 -10.9689 -10.9366 -10.9250 -10.8832 -10.7857 -10.6932 -10.5632 -10.4706 -10.4103 -10.3709 -10.3512 -10.3145 -10.0476 -9.8885 -9.6825 -9.6269 -9.6088 -9.5426 -9.3706 -9.3453 -9.1762 -9.0301 -8.6868 -8.6299 -8.3353 -8.1719 -8.1374 -8.0529 -7.9378 -7.6706 -7.5826 -7.3950 -7.2077 -7.0783 -6.9320 -6.6569 -6.6026 -6.1985 -6.0037 -5.8156 -5.6280 -5.3334 -3.8161 -2.7614 -1.5384 -1.3267 -1.1170 -0.6975 -0.4063 -0.2716 -0.2303 0.0593 0.1289 electronvolt
chargesum: -0.0000000
charge: -0.456594 0.097785 0.103280 -0.289942 0.258285 0.108148 0.257309 0.286605 0.024717 -0.094080 -0.028584 0.146390 0.074888 0.095846 -0.216828 -0.186822 -0.180919 -0.197153 0.528087 -0.470640 0.446044 0.303678 0.076685 0.135411 0.174759 -0.185759 -0.182885 -0.174358 -0.174105 -0.188157 0.166398 0.101054 -0.537513 -0.213970 -0.356257 -0.709246 -0.565835 -0.512909 -0.553744 -0.522922 -0.492406 0.179760 0.188143 0.171686 0.166159 0.166470 0.182530 0.161549 0.176593 0.192828 0.176409 0.170852 0.181800 0.169366 0.177790 0.165846 0.186360 0.177639 0.156142 0.179146 0.161492 0.152359 0.150816 0.147201 0.167321
charge: -0.255236 -0.064057 -0.082557 -0.248520 -0.002930 -0.064615 -0.041028 -0.001202 -0.022527 -0.133827 0.217075 0.233589 0.234924 0.228135 -0.281446 -0.250517 -0.244635 -0.262450 0.107069 -0.103959 0.263552 0.243478 0.218151 0.203240 0.239080 -0.233733 -0.229087 -0.239458 -0.229702 -0.248340 -0.186789 -0.200268 -0.255337 -0.183510 -0.179143 -0.355527 -0.364208 -0.361865 -0.360912 -0.353287 -0.325022 0.177328 0.184641 0.179718 0.169655 0.178035 0.180734 0.170034 0.178193 0.184410 0.178379 0.180856 0.184408 0.170230 0.179767 0.173809 0.169246 0.186209 0.165301 0.167342 0.159415 0.164200 0.164797 0.165425 0.165271
qa: -0.4566 0.0978 0.1033 -0.2899 0.2583 0.1081 0.2573 0.2866 0.0247 -0.0941 -0.0286 0.1464 0.0749 0.0958 -0.2168 -0.1868 -0.1809 -0.1972 0.5281 -0.4706 0.4460 0.3037 0.0767 0.1354 0.1748 -0.1858 -0.1829 -0.1744 -0.1741 -0.1882 0.1664 0.1011 -0.5375 -0.2140 -0.3563 -0.7092 -0.5658 -0.5129 -0.5537 -0.5229 -0.4924 0.1798 0.1881 0.1717 0.1662 0.1665 0.1825 0.1615 0.1766 0.1928 0.1764 0.1709 0.1818 0.1694 0.1778 0.1658 0.1864 0.1776 0.1561 0.1791 0.1615 0.1524 0.1508 0.1472 0.1673
va: 3.7834 3.3016 3.3760 3.6214 3.5327 3.5724 3.6083 3.6019 3.9246 4.2552 3.7095 3.5433 3.6609 3.6178 0.9780 1.0206 1.0287 1.0027 3.3164 3.2150 3.4288 3.3785 3.6723 3.6364 3.5827 0.9964 1.0308 1.0313 1.0396 1.0231 3.3183 3.4143 3.7427 3.7914 3.8565 3.6671 3.6867 3.7395 3.7515 3.7438 0.6893 0.9529 0.9480 0.9555 0.9551 0.9597 0.9590 0.9543 0.9590 0.9498 0.9536 0.9598 0.9570 0.9534 0.9563 0.9628 0.9548 0.9616 0.9637 0.9570 0.9627 0.9737 0.9746 0.9698 0.9595
dispersion: -0.041259273 hartree
energy: -2253.200513554603 hartree
dipole: -32.907421504 36.606518005 3.699096501 -68.680519266 70.278079926 1.597560660 -5.092911072 5.800747141 0.707836069
dipolemethod: SCF
magnitude: 4.091032496 au
magnitude: 10.398578217 debye
temp: 298.15 k
press: 1.00 atm
zeropoint: 0.46702648 hartree
thermalvibcorrection: 0.03651569 hartree
thermalrotcorrection: 0.00141627 hartree
thermaltrasncorrection: 0.00141627 hartree
thermaltotal: -2252.69413884 hartree
thermalcorr: 0.03934823 hartree
nonthermalcorr: 0.46702648 hartree
totalcorr: 0.50637471 hartree
thermalcorrenthalpy: 0.00094421 hartree
totalenthalpy: -2252.69319463 hartree
vibrat: 0.06456155 hartree
rotat: 0.01782075 hartree
transl: 0.02157821 hartree
total: 0.10396051 hartree
totalentropycorr: -0.10396051 hartree
gibbsenthalpy: -2252.79715515 hartree
gibbsminuselec: 0.40335841 hartree
