program: Orca
programVersion: 6.0.1
elementType: C C C C C C C C C Rh C C C C F F F F B C C C C C C F F F F F C C C C C C C C C C F H H H H H H H H H H H H H H H H H H H H H H H H
elementType: Rh
charge: 0
multiplicity: 1
keywords: r2scan0 d4 ma-def2-qzvp SP TIGHTSCF NBO AIM SMD(toluene)
formula: C29H24BF10Rh
InChI: InChI=1/C19H8BF10.C10H15.Rh.H/c21-10-5-9(12(22)16(26)13(10)23)20(30,8-4-6-1-2-7(8)3-6)11-14(24)17(27)19(29)18(28)15(11)25;1-6-7(2)9(4)10(5)8(6)3;;/h1-2,4,6-8H,3H2;1-5H3;;/rC29H24BF10Rh/c1-25-26(2)28(4)29(5)27(25,3)41(25,26,28,29)23-10-7-6-9(8-10)11(23)30(40-41,12-14(31)17(34)20(37)18(35)15(12)32)13-16(33)19(36)21(38)22(39)24(13)41/h6-7,9-11,23,41H,8H2,1-5H3
65 atoms
C  -0.014556 0.006921 2.647142
C  -1.153483 1.367598 0.109985
C  -1.913381 0.187012 0.008431
C  -0.951486 -1.117224 2.155457
C  2.480275 1.071508 -0.660763
C  2.953744 0.602409 0.651889
C  1.994794 2.384714 -0.527125
C  2.743791 1.632062 1.58323
C  2.046178 2.718553 0.885852
Rh 0.721919 1.014103 0.814801
C  -1.714434 2.584729 -0.215061
C  -3.210881 0.294856 -0.461122
C  -3.77352 1.516757 -0.820785
C  -3.017699 2.67254 -0.695015
F  -1.040574 3.751558 -0.045125
F  -3.549416 3.86033 -1.018203
F  -5.031113 1.591777 -1.275483
F  -4.003895 -0.793514 -0.568984
B  -1.183351 -1.145043 0.539968
C  -1.673407 -2.532381 -0.132594
C  -2.157693 -3.650184 0.537683
C  -1.614296 -2.6633 -1.520263
C  -2.561801 -4.815377 -0.10546
C  -1.999897 -3.806187 -2.204687
C  -2.480383 -4.894256 -1.487463
F  -1.174747 -1.633989 -2.272064
F  -2.272597 -3.656611 1.883323
F  -3.019837 -5.862447 0.59367
F  -2.856199 -6.00715 -2.124256
F  -1.920068 -3.874565 -3.540244
C  -2.204548 -0.915867 3.082138
C  -0.806643 0.692962 3.802987
C  -2.244105 0.617061 3.255577
C  -0.876058 -0.373551 4.891259
C  -1.721071 -1.319853 4.466624
C  2.538542 0.262178 -1.907616
C  3.568785 -0.73626 0.877491
C  1.517343 3.257873 -1.640381
C  1.794129 4.064658 1.475184
C  3.126684 1.652074 3.023541
F  0.275374 -0.953098 0.042049
H  -0.465648 -2.069814 2.405359
H  3.581952 0.099377 -2.20701
H  2.079077 -0.720436 -1.757411
H  2.017056 0.75712 -2.729029
H  2.348527 3.481945 -2.319692
H  0.729421 2.771112 -2.222696
H  1.118523 4.200256 -1.266122
H  2.701344 4.676954 1.385816
H  0.978991 4.580775 0.968268
H  1.543111 3.992727 2.536033
H  4.03453 2.250899 3.168121
H  2.338696 2.092551 3.641257
H  3.32678 0.646648 3.400812
H  4.57928 -0.770452 0.451108
H  3.64545 -0.973485 1.94071
H  2.978943 -1.521819 0.394852
H  0.97807 -0.321877 2.967602
H  -0.067532 1.695135 1.948508
H  -0.429033 1.669425 4.121891
H  -2.983278 0.92957 3.998662
H  -2.391417 1.162229 2.320445
H  -0.248358 -0.391699 5.775611
H  -1.933364 -2.271966 4.941506
H  -3.116335 -1.394864 2.722683
elementType: C Rh F B H
totalener: -2253.01176255372229 hartree
nucrepener: 5764.44324868921467 hartree
electener: -8017.42906747899269 hartree
twoeener: 6608.25665719799053 hartree
cpcmener: -0.01775501312063 hartree
kineticenergy: 2173.45577501927210 hartree
exchangeener: -206.572254289694 hartree
energy: -679.6822 -679.5311 -679.5311 -679.4730 -679.3900 -679.2190 -679.2189 -679.2053 -679.0166 -677.8659 -284.3623 -284.1460 -284.1420 -284.0980 -284.0584 -284.0571 -283.9579 -283.7798 -283.7418 -283.0808 -282.8251 -282.7651 -282.7467 -282.7129 -282.3984 -281.8377 -281.7024 -281.6195 -281.6065 -281.5684 -281.5394 -281.4942 -281.4077 -281.2776 -281.1029 -281.0532 -281.0332 -280.9266 -280.6662 -186.9436 -92.2552 -57.8084 -57.5774 -57.2213 -36.2813 -36.0490 -35.9968 -35.8298 -35.7414 -35.4971 -35.4837 -35.4279 -35.2926 -33.4035 -26.6909 -25.5605 -25.4598 -25.1931 -23.3722 -23.2403 -22.3655 -22.1390 -21.9599 -21.8126 -21.4109 -21.3212 -21.3038 -21.1366 -20.6586 -20.1047 -19.0790 -18.8297 -18.7918 -18.5347 -18.5045 -18.3650 -17.0284 -16.7848 -16.6910 -16.4954 -16.3676 -16.1409 -16.0052 -15.9084 -15.6749 -15.6073 -15.4479 -15.3471 -15.1377 -15.0566 -14.9795 -14.8605 -14.7249 -14.6887 -14.4047 -14.2312 -14.2206 -14.1016 -13.9693 -13.9208 -13.8599 -13.7674 -13.5233 -13.4444 -13.4209 -13.2501 -13.1423 -12.9286 -12.8813 -12.8511 -12.8218 -12.7644 -12.6974 -12.6230 -12.5359 -12.4004 -12.2149 -12.1288 -12.0911 -12.0018 -11.8850 -11.8228 -11.8035 -11.7814 -11.6724 -11.4630 -11.4049 -11.2560 -11.2169 -11.0151 -10.9656 -10.7999 -10.6216 -10.4671 -10.4286 -10.3657 -10.3035 -10.1053 -10.0080 -9.8712 -9.6182 -9.5491 -9.4063 -8.9510 -8.7747 -8.5133 -8.3852 -8.1875 -7.9391 -7.3678 -7.1546 -7.0557 -6.9267 -6.7423 -6.6269 -2.4985 -1.1525 -0.4048 -0.2994 -0.1582 -0.0115 0.0826 0.1391 0.1750 0.2769 0.3126 electronvolt
chargesum: 0.0000000
charge: -0.309959 -0.347595 -0.262716 -0.107778 -0.017440 -0.045226 0.043876 -0.180768 0.022854 1.713527 0.160988 0.291749 0.081846 0.189863 -0.308398 -0.282425 -0.277500 -0.316663 0.994757 -0.272054 0.281180 0.526051 0.007268 -0.028929 0.444700 -0.266886 -0.291376 -0.272142 -0.245919 -0.272615 0.007971 0.071324 -0.057930 -0.192328 -0.088414 -0.195054 -0.160139 -0.191425 -0.146570 -0.130088 -0.579284 0.000871 0.052741 0.066691 0.050584 0.051901 0.067862 0.052831 0.061667 0.050425 0.040025 0.061778 0.046751 0.048006 0.053928 0.041694 0.060477 -0.024824 -0.042839 0.037170 0.018857 -0.004630 0.056284 0.066738 0.094678
charge: 0.063211 -0.118023 -0.012613 0.051479 -0.125155 -0.142681 -0.135547 -0.158977 -0.157152 0.722431 -0.431734 -0.366997 -0.380716 -0.384282 0.278201 0.347737 0.350554 0.328212 -1.023374 0.055630 -0.355612 -0.352661 -0.376294 -0.375719 -0.375945 0.342228 0.320988 0.352438 0.362933 0.353067 -0.025592 -0.086748 0.122926 0.071882 0.086677 0.248642 0.240804 0.244212 0.237949 0.230980 0.229417 0.027599 -0.010445 -0.002117 -0.010034 -0.013536 -0.005596 -0.013287 -0.009553 -0.014258 -0.012650 -0.012231 -0.010664 -0.015486 -0.012690 -0.015937 -0.004205 -0.019755 -0.005535 -0.012498 -0.006823 -0.004483 -0.041223 -0.033169 0.001799
qa: -0.3100 -0.3476 -0.2627 -0.1078 -0.0174 -0.0452 0.0439 -0.1808 0.0229 1.7135 0.1610 0.2917 0.0818 0.1899 -0.3084 -0.2824 -0.2775 -0.3167 0.9948 -0.2721 0.2812 0.5261 0.0073 -0.0289 0.4447 -0.2669 -0.2914 -0.2721 -0.2459 -0.2726 0.0080 0.0713 -0.0579 -0.1923 -0.0884 -0.1951 -0.1601 -0.1914 -0.1466 -0.1301 -0.5793 0.0009 0.0527 0.0667 0.0506 0.0519 0.0679 0.0528 0.0617 0.0504 0.0400 0.0618 0.0468 0.0480 0.0539 0.0417 0.0605 -0.0248 -0.0428 0.0372 0.0189 -0.0046 0.0563 0.0667 0.0947
va: 3.5646 3.0741 2.4110 3.2694 3.3889 3.2864 3.2941 3.4925 3.2757 2.9363 3.2121 3.0966 3.4994 3.4234 0.8040 0.8687 0.8753 0.8304 2.2344 2.7427 3.1718 2.9637 3.7237 3.7351 3.2929 0.8312 0.8100 0.9042 0.8972 0.9097 3.6387 3.5561 3.7267 3.7190 3.6069 3.8343 3.8161 3.7799 3.7001 3.7355 0.3412 0.9004 0.9899 1.0047 1.0010 0.9975 0.9776 0.9940 0.9996 1.0024 0.9953 0.9973 0.9881 0.9921 0.9961 1.0012 1.0037 1.0020 1.1082 0.9924 0.9955 1.1008 1.0211 1.0158 0.9706
dispersion: -0.043544692 hartree
energy: -2253.055307245410 hartree
dipole: -37.545473922 42.871250862 5.325776941 -39.698390202 42.209846230 2.511456029 5.860684729 -4.298593893 1.562090835
dipolemethod: SCF
magnitude: 6.091915888 au
magnitude: 15.484419619 debye
