program: Orca
programVersion: 6.0.1
elementType: C C C C C C C C C Rh C C C C F F F F B C C C C C C F F F F F C C C C C C C C C C F H H H H H H H H H H H H H H H H H H H H H H H H
elementType: Rh
charge: 0
multiplicity: 1
keywords: r2scan-3c OPTTS FREQ
frequency: 0.00 0.00 0.00 0.00 0.00 0.00 -659.96 19.63 26.72 28.63 39.96 42.14 47.88 78.71 90.01 97.54 103.24 107.59 122.21 126.26 135.77 144.32 149.44 153.76 159.41 161.15 164.76 165.53 168.97 172.89 175.10 177.83 187.38 197.72 209.13 220.13 230.04 237.30 246.35 257.19 263.71 276.91 281.18 286.56 287.95 289.67 293.82 303.45 305.00 311.61 323.04 335.85 350.40 351.91 356.28 369.42 384.31 395.03 410.00 435.57 450.54 453.56 466.18 479.40 493.40 509.54 522.01 525.72 539.78 544.57 561.48 582.01 588.24 608.79 616.97 619.62 628.40 631.83 638.25 650.29 663.35 668.88 690.22 694.49 719.35 749.71 768.70 771.61 780.61 795.23 800.29 804.19 810.53 825.76 853.57 889.08 891.71 903.17 920.93 921.74 944.59 953.12 953.88 973.92 979.94 990.91 999.56 1022.82 1028.90 1034.83 1035.86 1039.61 1044.45 1048.75 1051.53 1086.09 1089.87 1100.65 1109.39 1118.32 1119.21 1121.84 1134.12 1141.90 1161.54 1171.02 1172.26 1192.14 1217.80 1225.09 1255.63 1265.31 1270.81 1273.93 1290.88 1299.61 1305.53 1327.25 1337.33 1340.95 1351.81 1362.87 1391.17 1391.28 1405.97 1406.76 1408.54 1413.45 1422.50 1431.27 1455.69 1460.96 1462.46 1465.72 1470.61 1474.46 1475.79 1476.22 1479.94 1483.74 1484.14 1484.99 1490.34 1531.08 1534.25 1584.84 1595.91 1605.30 1618.22 1640.37 1661.71 1872.19 3005.94 3006.29 3009.46 3010.94 3012.92 3019.80 3041.49 3063.04 3072.29 3079.64 3080.63 3084.51 3085.64 3098.95 3117.63 3119.59 3125.12 3134.65 3136.16 3139.59 3140.31 3185.22 3209.69
frequency: 19.63 26.72 28.63 39.96 42.14 47.88 78.71 90.01 97.54 103.24 107.59 122.21 126.26 135.77 144.32 149.44 153.76 159.41 161.15 164.76 165.53 168.97 172.89 175.10 177.83 187.38 197.72 209.13 220.13 230.04 237.30 246.35 257.19 263.71 276.91 281.18 286.56 287.95 289.67 293.82 303.45 305.00 311.61 323.04 335.85 350.40 351.91 356.28 369.42 384.31 395.03 410.00 435.57 450.54 453.56 466.18 479.40 493.40 509.54 522.01 525.72 539.78 544.57 561.48 582.01 588.24 608.79 616.97 619.62 628.40 631.83 638.25 650.29 663.35 668.88 690.22 694.49 719.35 749.71 768.70 771.61 780.61 795.23 800.29 804.19 810.53 825.76 853.57 889.08 891.71 903.17 920.93 921.74 944.59 953.12 953.88 973.92 979.94 990.91 999.56 1022.82 1028.90 1034.83 1035.86 1039.61 1044.45 1048.75 1051.53 1086.09 1089.87 1100.65 1109.39 1118.32 1119.21 1121.84 1134.12 1141.90 1161.54 1171.02 1172.26 1192.14 1217.80 1225.09 1255.63 1265.31 1270.81 1273.93 1290.88 1299.61 1305.53 1327.25 1337.33 1340.95 1351.81 1362.87 1391.17 1391.28 1405.97 1406.76 1408.54 1413.45 1422.50 1431.27 1455.69 1460.96 1462.46 1465.72 1470.61 1474.46 1475.79 1476.22 1479.94 1483.74 1484.14 1484.99 1490.34 1531.08 1534.25 1584.84 1595.91 1605.30 1618.22 1640.37 1661.71 1872.19 3005.94 3006.29 3009.46 3010.94 3012.92 3019.80 3041.49 3063.04 3072.29 3079.64 3080.63 3084.51 3085.64 3098.95 3117.63 3119.59 3125.12 3134.65 3136.16 3139.59 3140.31 3185.22 3209.69
formula: C29H24BF10Rh
InChI: InChI=1/C19H8BF10.C10H15.Rh.H/c21-10-5-9(12(22)16(26)13(10)23)20(30,8-4-6-1-2-7(8)3-6)11-14(24)17(27)19(29)18(28)15(11)25;1-6-7(2)9(4)10(5)8(6)3;;/h1-2,4,6-8H,3H2;1-5H3;;/rC29H24BF10Rh/c1-9-26(2)28(4)29(5)27(9,3)41(26,28,29)24-11-7-6-10(8-11)12(24)30(40,13-15(31)18(34)21(37)19(35)16(13)32)14-17(33)20(36)22(38)23(39)25(14)41/h6-7,10-12,24,41H,8H2,1-5H3
65 atoms
C  -0.056656 0.114857 2.349438
C  -0.852525 0.833696 -0.446681
C  -1.707131 -0.285142 -0.344903
C  -1.039438 -1.047617 2.12107
C  2.397981 2.14875 -0.576837
C  2.700832 0.89981 0.140611
C  2.1706 3.12672 0.38345
C  2.846996 1.208099 1.553676
C  2.410893 2.532866 1.719399
Rh 0.711223 1.273887 0.8193
C  -1.197362 1.899532 -1.274644
C  -2.925047 -0.213443 -0.993794
C  -3.292448 0.870266 -1.790397
C  -2.419759 1.937618 -1.931703
F  -0.413178 2.998139 -1.412976
F  -2.768219 2.998666 -2.671958
F  -4.47218 0.897061 -2.414247
F  -3.835554 -1.202324 -0.895291
B  -1.163618 -1.537093 0.569594
C  -1.927167 -2.956476 0.305462
C  -2.509276 -3.786101 1.256177
C  -1.94679 -3.465483 -0.993352
C  -3.084187 -5.017868 0.956526
C  -2.504419 -4.686177 -1.341353
C  -3.080793 -5.472463 -0.352195
F  -1.417815 -2.742483 -2.001694
F  -2.551214 -3.434863 2.562095
F  -3.632245 -5.772593 1.920455
F  -3.624357 -6.65532 -0.659489
F  -2.499356 -5.115263 -2.611408
C  -2.335918 -0.511461 2.833677
C  -0.898948 1.197954 3.131142
C  -2.301715 1.002515 2.533801
C  -1.086639 0.520606 4.486437
C  -1.95999 -0.479302 4.307093
C  2.375538 2.259589 -2.062628
C  3.137354 -0.365447 -0.510367
C  1.775267 4.547538 0.176903
C  2.330983 3.299284 2.995478
C  3.358064 0.273467 2.593273
F  0.227986 -1.763994 0.1017
H  -0.662825 -1.912464 2.68337
H  3.384941 2.10053 -2.462687
H  1.72293 1.504666 -2.511484
H  2.025466 3.238272 -2.391762
H  2.546315 5.221149 0.571605
H  1.627148 4.773269 -0.87973
H  0.841441 4.783975 0.699165
H  3.250307 3.880062 3.148512
H  1.499348 4.010105 2.984159
H  2.206111 2.638208 3.856565
H  4.454406 0.31191 2.62358
H  2.990119 0.531369 3.589796
H  3.06846 -0.759159 2.380349
H  4.221057 -0.326078 -0.68766
H  2.919609 -1.233901 0.114515
H  2.640774 -0.514585 -1.471699
H  0.831645 -0.188361 2.910592
H  0.487103 -0.07652 0.031096
H  -0.489071 2.214103 3.174789
H  -3.061063 1.549339 3.101089
H  -2.375525 1.246864 1.473724
H  -0.494767 0.743261 5.367421
H  -2.261105 -1.222362 5.037884
H  -3.255112 -1.0388 2.576584
totalener: -2253.13569279051990 hartree
nucrepener: 5712.29121791094258 hartree
electener: -7965.42691070146248 hartree
twoeener: 6556.31971737360800 hartree
kineticenergy: 2174.70478798115118 hartree
exchangeener: -275.448554873752 hartree
correlationener: -10.516999997421 hartree
xcener: -285.965554871173 hartree
dispersion: -0.040637415 hartree
temp: 298.15 k
press: 1.00 atm
thermalcorrenthalpy: 0.00094421 hartree
totalenthalpy: -2252.64064447 hartree
vibrat: 0.06439787 hartree
rotat: 0.01799099 hartree
transl: 0.02157821 hartree
total: 0.10396707 hartree
totalentropycorr: -0.10396707 hartree
gibbsenthalpy: -2252.74461154 hartree
gibbsminuselec: 0.39700255 hartree
dispersion: -0.040639276 hartree
dispersion: -0.040633117 hartree
dispersion: -0.040635707 hartree
energy: -667.1899 -667.1870 -667.1338 -666.8266 -666.6730 -666.6495 -666.5606 -666.4194 -666.3180 -664.5804 -275.8798 -275.8705 -275.8587 -275.5099 -275.4781 -275.3182 -275.3119 -275.3013 -275.2668 -275.1910 -275.0041 -274.8389 -274.8285 -274.7297 -274.1759 -274.1746 -274.0077 -273.9886 -273.8176 -273.8098 -273.7523 -273.7369 -273.0803 -273.0797 -272.9978 -272.9719 -272.8595 -272.6773 -272.1859 -179.8176 -88.0180 -54.6462 -54.4149 -53.8664 -33.0982 -32.8352 -32.6894 -32.5848 -32.4048 -32.2473 -32.1675 -31.9440 -31.8755 -29.5038 -24.7412 -23.1834 -23.0336 -22.7194 -21.6246 -21.5507 -20.0384 -19.8899 -19.8335 -19.7416 -19.6203 -19.5931 -19.4487 -19.1022 -18.6546 -18.1338 -17.4274 -17.0604 -16.7579 -16.6722 -16.4407 -16.2815 -14.9849 -14.7372 -14.5875 -14.4749 -14.4493 -14.4369 -14.3038 -14.2356 -14.1115 -14.0536 -13.5050 -13.4049 -13.2727 -13.2069 -13.1307 -13.0573 -13.0416 -12.8969 -12.7568 -12.5445 -12.3695 -12.2793 -12.1328 -12.0167 -11.9718 -11.9210 -11.8395 -11.7556 -11.6863 -11.5608 -11.4866 -11.2528 -11.1806 -11.1659 -11.0282 -11.0000 -10.9383 -10.8950 -10.8740 -10.7768 -10.6834 -10.5765 -10.4994 -10.4335 -10.3937 -10.2562 -10.1786 -10.1387 -10.0185 -9.9565 -9.7882 -9.6453 -9.6229 -9.5756 -9.4787 -9.4406 -9.2270 -9.2088 -9.0370 -8.8392 -8.7754 -8.7424 -8.5283 -8.4494 -8.2984 -8.1606 -8.0615 -7.9692 -7.6119 -7.1889 -7.0715 -6.7812 -6.6378 -6.1351 -6.1168 -5.9006 -5.7495 -5.5923 -5.5566 -4.2409 -2.0469 -1.3035 -0.9025 -0.6083 -0.5657 -0.4608 -0.3495 -0.2394 -0.1821 -0.1212 electronvolt
chargesum: 0.0000000
charge: -0.033074 -0.160856 0.112776 -0.407604 0.103324 0.393819 0.138102 -0.125417 0.302352 -0.448912 0.161957 0.275637 0.080365 0.117078 -0.206436 -0.184166 -0.172112 -0.200949 0.395984 -0.013057 0.172618 0.285635 0.056137 0.064114 0.161965 -0.211943 -0.209423 -0.187863 -0.187327 -0.185612 0.159936 0.156034 -0.622424 -0.290945 -0.275757 -0.611407 -0.439068 -0.581511 -0.550241 -0.623218 -0.461383 0.192047 0.166905 0.188063 0.163772 0.165877 0.167749 0.176890 0.179934 0.167330 0.168681 0.173938 0.163423 0.185283 0.172366 0.189827 0.174909 0.199975 0.226516 0.161583 0.175361 0.184045 0.154389 0.163023 0.190979
charge: -0.105605 -0.087828 -0.087473 -0.232382 -0.050158 -0.007565 -0.044892 -0.058335 -0.047905 -0.339826 0.224706 0.228928 0.244400 0.226305 -0.265963 -0.246877 -0.236348 -0.251036 0.083463 -0.098435 0.234206 0.238573 0.218128 0.220476 0.231160 -0.251923 -0.269746 -0.251868 -0.244300 -0.250038 -0.168079 -0.166695 -0.240844 -0.185119 -0.143086 -0.366089 -0.360020 -0.367711 -0.367850 -0.369111 -0.392379 0.190114 0.169813 0.181441 0.172568 0.171246 0.174081 0.177512 0.177012 0.173588 0.173281 0.174616 0.170673 0.179683 0.175960 0.185302 0.181970 0.186029 0.351301 0.171104 0.169906 0.180642 0.166764 0.173454 0.177084
qa: -0.0331 -0.1609 0.1128 -0.4076 0.1033 0.3938 0.1381 -0.1254 0.3024 -0.4489 0.1620 0.2756 0.0804 0.1171 -0.2064 -0.1842 -0.1721 -0.2009 0.3960 -0.0131 0.1726 0.2856 0.0561 0.0641 0.1620 -0.2119 -0.2094 -0.1879 -0.1873 -0.1856 0.1599 0.1560 -0.6224 -0.2909 -0.2758 -0.6114 -0.4391 -0.5815 -0.5502 -0.6232 -0.4614 0.1920 0.1669 0.1881 0.1638 0.1659 0.1677 0.1769 0.1799 0.1673 0.1687 0.1739 0.1634 0.1853 0.1724 0.1898 0.1749 0.2000 0.2265 0.1616 0.1754 0.1840 0.1544 0.1630 0.1910
va: 3.6517 3.4621 3.1455 3.7480 3.5971 3.3105 3.5775 3.8563 3.2850 4.5857 3.7054 3.3887 3.6363 3.6232 0.9974 1.0249 1.0385 0.9936 3.6234 3.4535 3.5747 3.5564 3.6642 3.6872 3.6245 1.0052 0.9999 1.0213 1.0315 1.0266 3.3563 3.4077 3.7000 3.8039 3.8054 3.7605 3.7109 3.7577 3.7157 3.7543 0.7910 0.9594 0.9537 0.9513 0.9622 0.9540 0.9626 0.9527 0.9527 0.9572 0.9596 0.9542 0.9601 0.9533 0.9532 0.9544 0.9576 0.9488 0.9541 0.9608 0.9559 0.9596 0.9732 0.9708 0.9548
dispersion: -0.040634807 hartree
energy: -2253.141740993663 hartree
dipole: -36.640815385 40.851632087 4.210816701 -51.291774908 55.069305661 3.777530753 5.199953565 -3.752428226 1.447525339
dipolemethod: SCF
magnitude: 5.839181919 au
magnitude: 14.842020924 debye
zeropoint: 0.46086250 hartree
thermalvibcorrection: 0.03635836 hartree
thermalrotcorrection: 0.00141627 hartree
thermaltrasncorrection: 0.00141627 hartree
thermaltotal: -2252.64168759 hartree
thermalcorr: 0.03919091 hartree
nonthermalcorr: 0.46086250 hartree
totalcorr: 0.50005340 hartree
totalenthalpy: -2252.64074338 hartree
vibrat: 0.06441648 hartree
rotat: 0.01799133 hartree
total: 0.10398602 hartree
