program: Orca
programVersion: 6.0.1
elementType: C C C C C C C C C Rh C C C C F F F F B C C C C C C F F F F F C C C C C C C C C C F H H H H H H H H H H H H H H H H H H H H H H H H
elementType: Rh
charge: 0
multiplicity: 1
keywords: r2scan-3c OPT FREQ
frequency: 0.00 0.00 0.00 0.00 0.00 0.00 21.89 24.55 28.47 40.39 42.20 45.31 60.81 86.57 87.60 95.49 101.05 115.23 118.55 124.65 133.88 136.90 144.85 151.90 153.91 155.14 158.21 162.55 166.89 168.59 173.41 178.02 182.48 204.50 210.48 215.67 220.96 222.25 238.27 245.64 255.70 279.27 281.99 286.00 286.37 287.41 291.09 301.93 304.79 314.10 320.55 346.95 352.27 352.32 360.06 367.16 384.25 388.69 401.53 442.23 452.12 460.84 474.16 489.04 491.77 517.63 529.90 535.28 541.22 554.83 558.42 566.10 583.84 587.65 610.02 612.65 619.33 632.94 638.96 649.15 653.73 658.31 669.09 677.07 706.08 725.09 757.29 769.45 772.77 780.79 796.20 799.58 805.46 808.73 816.01 847.08 856.82 900.96 911.76 928.95 944.20 955.18 955.71 983.08 984.81 995.35 1003.90 1026.23 1031.60 1034.16 1037.71 1048.46 1049.29 1050.15 1085.10 1089.61 1092.39 1111.52 1115.06 1119.14 1140.90 1146.77 1156.64 1164.77 1169.77 1171.96 1177.82 1193.31 1228.05 1235.10 1250.32 1273.24 1278.34 1296.14 1299.27 1311.82 1328.61 1333.99 1338.72 1341.01 1359.09 1369.43 1390.25 1397.62 1404.88 1406.55 1408.06 1410.50 1413.80 1419.54 1456.80 1460.83 1462.92 1467.50 1470.83 1475.45 1477.31 1481.41 1482.76 1482.92 1486.36 1487.95 1492.57 1534.63 1538.13 1576.65 1602.32 1605.96 1622.26 1638.26 1662.30 3000.45 3003.53 3007.34 3008.36 3008.87 3029.43 3046.94 3053.75 3064.42 3070.42 3076.95 3078.99 3083.37 3093.01 3113.03 3114.02 3116.00 3128.90 3134.84 3138.66 3149.32 3183.32 3208.18 3252.25
frequency: 21.89 24.55 28.47 40.39 42.20 45.31 60.81 86.57 87.60 95.49 101.05 115.23 118.55 124.65 133.88 136.90 144.85 151.90 153.91 155.14 158.21 162.55 166.89 168.59 173.41 178.02 182.48 204.50 210.48 215.67 220.96 222.25 238.27 245.64 255.70 279.27 281.99 286.00 286.37 287.41 291.09 301.93 304.79 314.10 320.55 346.95 352.27 352.32 360.06 367.16 384.25 388.69 401.53 442.23 452.12 460.84 474.16 489.04 491.77 517.63 529.90 535.28 541.22 554.83 558.42 566.10 583.84 587.65 610.02 612.65 619.33 632.94 638.96 649.15 653.73 658.31 669.09 677.07 706.08 725.09 757.29 769.45 772.77 780.79 796.20 799.58 805.46 808.73 816.01 847.08 856.82 900.96 911.76 928.95 944.20 955.18 955.71 983.08 984.81 995.35 1003.90 1026.23 1031.60 1034.16 1037.71 1048.46 1049.29 1050.15 1085.10 1089.61 1092.39 1111.52 1115.06 1119.14 1140.90 1146.77 1156.64 1164.77 1169.77 1171.96 1177.82 1193.31 1228.05 1235.10 1250.32 1273.24 1278.34 1296.14 1299.27 1311.82 1328.61 1333.99 1338.72 1341.01 1359.09 1369.43 1390.25 1397.62 1404.88 1406.55 1408.06 1410.50 1413.80 1419.54 1456.80 1460.83 1462.92 1467.50 1470.83 1475.45 1477.31 1481.41 1482.76 1482.92 1486.36 1487.95 1492.57 1534.63 1538.13 1576.65 1602.32 1605.96 1622.26 1638.26 1662.30 3000.45 3003.53 3007.34 3008.36 3008.87 3029.43 3046.94 3053.75 3064.42 3070.42 3076.95 3078.99 3083.37 3093.01 3113.03 3114.02 3116.00 3128.90 3134.84 3138.66 3149.32 3183.32 3208.18 3252.25
formula: C29H24BF10Rh
InChI: InChI=1/C19H8BF9.C10H15.FH.Rh/c21-10-5-9(12(22)16(26)13(10)23)20(8-4-6-1-2-7(8)3-6)11-14(24)17(27)19(29)18(28)15(11)25;1-6-7(2)9(4)10(5)8(6)3;;/h1-2,4,6-8H,3H2;1-5H3;1H;/rC29H23BF9Rh.FH/c1-25-26(2)28(4)29(5)27(25,3)40(25,26,28,29)23-10-7-6-9(8-10)11(23)30(12-14(31)17(34)20(37)18(35)15(12)32)13-16(33)19(36)21(38)22(39)24(13)40;/h6-7,9-11,23H,8H2,1-5H3;1H
65 atoms
C  -0.215134 0.196879 2.377973
C  -0.958867 0.974256 -0.33964
C  -1.80395 -0.174769 -0.357339
C  -1.306587 -0.888704 2.199713
C  2.242332 2.134646 -0.612867
C  2.544151 0.826602 -0.044516
C  2.141344 3.030992 0.451623
C  2.804197 0.994866 1.387052
C  2.481882 2.32317 1.703208
Rh 0.661546 1.294472 0.86629
C  -1.272669 2.005701 -1.214705
C  -2.860265 -0.210596 -1.267929
C  -3.145261 0.835532 -2.135914
C  -2.343873 1.964509 -2.099791
F  -0.569553 3.170829 -1.214528
F  -2.62176 3.001966 -2.897562
F  -4.186557 0.77753 -2.972736
F  -3.704194 -1.262512 -1.323654
B  -1.678327 -1.296399 0.725006
C  -2.039264 -2.796087 0.3952
C  -2.657401 -3.657288 1.302349
C  -1.679882 -3.375471 -0.825562
C  -2.919482 -4.992807 1.030003
C  -1.902302 -4.710404 -1.127026
C  -2.532933 -5.523377 -0.19314
F  -1.071292 -2.643055 -1.769163
F  -3.065647 -3.203023 2.501791
F  -3.534106 -5.770787 1.927883
F  -2.766113 -6.806141 -0.470532
F  -1.522792 -5.223555 -2.302037
C  -2.553786 -0.24166 2.96104
C  -0.967527 1.338137 3.193689
C  -2.392225 1.25042 2.625149
C  -1.174265 0.693035 4.554125
C  -2.125122 -0.240699 4.414596
C  2.110327 2.386324 -2.076348
C  2.932609 -0.347979 -0.875411
C  1.774497 4.472749 0.403748
C  2.551369 2.977331 3.041236
C  3.317049 -0.066449 2.298633
F  0.819474 -1.871227 0.50362
H  -1.005096 -1.786427 2.751623
H  3.081534 2.247272 -2.568611
H  1.405207 1.68914 -2.539687
H  1.763796 3.398502 -2.286296
H  2.607824 5.090629 0.761861
H  1.513975 4.790388 -0.606447
H  0.915036 4.681592 1.050901
H  3.510705 3.496315 3.168709
H  1.760913 3.724312 3.16245
H  2.456181 2.248312 3.850083
H  4.409938 -0.134878 2.225384
H  3.066731 0.144376 3.341525
H  2.903388 -1.046643 2.043442
H  3.898505 -0.129082 -1.352668
H  3.037524 -1.259192 -0.286928
H  2.20429 -0.535944 -1.668587
H  0.615356 -0.200624 2.974157
H  0.780332 -0.916825 0.610373
H  -0.485452 2.321204 3.2088
H  -3.096637 1.870489 3.188521
H  -2.457839 1.473721 1.558884
H  -0.54781 0.87382 5.421166
H  -2.443122 -0.970618 5.151147
H  -3.519257 -0.699538 2.739903
totalener: -2253.13909674708339 hartree
nucrepener: 5710.34422973443088 hartree
electener: -7963.48332648151427 hartree
twoeener: 6554.41590269562676 hartree
kineticenergy: 2174.67258441547392 hartree
exchangeener: -275.439274884066 hartree
correlationener: -10.516387250055 hartree
xcener: -285.955662134120 hartree
dispersion: -0.040611482 hartree
dispersion: -0.040624252 hartree
dispersion: -0.040599141 hartree
dispersion: -0.040593545 hartree
dispersion: -0.040576810 hartree
dispersion: -0.040599447 hartree
dispersion: -0.040617700 hartree
dispersion: -0.040657140 hartree
dispersion: -0.040673557 hartree
dispersion: -0.040692352 hartree
dispersion: -0.040690131 hartree
dispersion: -0.040689579 hartree
dispersion: -0.040688959 hartree
dispersion: -0.040692580 hartree
dispersion: -0.040694800 hartree
dispersion: -0.040697711 hartree
dispersion: -0.040698175 hartree
dispersion: -0.040697306 hartree
dispersion: -0.040695625 hartree
dispersion: -0.040693898 hartree
dispersion: -0.040691509 hartree
dispersion: -0.040690213 hartree
dispersion: -0.040691396 hartree
dispersion: -0.040702862 hartree
dispersion: -0.040695320 hartree
dispersion: -0.040672453 hartree
dispersion: -0.040660841 hartree
dispersion: -0.040638243 hartree
dispersion: -0.040608850 hartree
dispersion: -0.040580069 hartree
dispersion: -0.040548417 hartree
dispersion: -0.040488013 hartree
dispersion: -0.040435469 hartree
dispersion: -0.040422781 hartree
dispersion: -0.040397784 hartree
dispersion: -0.040355985 hartree
dispersion: -0.040316236 hartree
dispersion: -0.040300120 hartree
dispersion: -0.040262601 hartree
dispersion: -0.040230641 hartree
dispersion: -0.040203336 hartree
dispersion: -0.040196640 hartree
dispersion: -0.040204698 hartree
dispersion: -0.040222470 hartree
dispersion: -0.040234072 hartree
dispersion: -0.040238822 hartree
dispersion: -0.040237838 hartree
dispersion: -0.040233349 hartree
dispersion: -0.040226264 hartree
dispersion: -0.040222693 hartree
dispersion: -0.040221751 hartree
dispersion: -0.040222419 hartree
dispersion: -0.040223036 hartree
energy: -667.3913 -667.2019 -667.1848 -667.1625 -667.0845 -667.0645 -666.9289 -666.8009 -666.7991 -665.5848 -276.1697 -275.9676 -275.9197 -275.9155 -275.8885 -275.8811 -275.7472 -275.6539 -275.4903 -274.8054 -274.5202 -274.4572 -274.4070 -274.2097 -273.7850 -273.6695 -273.6193 -273.5491 -273.4800 -273.4627 -273.4627 -273.4180 -273.3785 -273.3455 -273.0903 -273.0058 -272.9357 -272.8368 -272.6100 -180.4143 -87.2439 -54.0163 -53.3888 -53.1324 -33.2782 -33.0495 -32.9855 -32.8496 -32.7430 -32.5901 -32.5122 -32.3644 -32.2967 -30.8374 -24.3149 -23.3460 -23.1292 -22.9023 -21.2139 -21.1547 -20.3581 -20.0837 -19.8645 -19.6992 -19.5042 -19.3673 -19.2191 -19.1064 -18.6701 -18.1369 -17.2258 -17.0386 -16.9000 -16.7082 -16.6314 -16.4663 -15.2525 -14.9774 -14.8833 -14.7141 -14.5637 -14.3667 -14.1895 -14.1152 -14.0604 -14.0375 -13.8054 -13.6555 -13.4574 -13.4339 -13.3648 -13.1789 -13.1081 -12.8759 -12.8198 -12.7080 -12.5928 -12.3662 -12.2672 -12.1692 -12.0351 -11.9834 -11.8517 -11.6437 -11.5831 -11.5591 -11.4639 -11.4418 -11.3967 -11.2738 -11.2016 -10.8721 -10.7882 -10.7408 -10.7100 -10.6619 -10.6398 -10.6038 -10.5597 -10.4819 -10.3043 -10.2391 -10.1909 -10.1066 -10.0838 -10.0140 -9.8478 -9.6920 -9.5444 -9.4465 -9.3194 -9.2898 -9.2834 -9.2291 -9.1464 -9.1070 -8.7930 -8.7180 -8.6683 -8.6070 -8.3071 -8.2678 -8.0324 -7.9306 -7.5899 -7.0567 -6.8450 -6.5877 -6.2786 -6.1755 -6.0693 -6.0464 -5.9533 -5.6409 -5.3853 -3.6649 -2.4146 -1.3412 -1.0677 -0.8197 -0.6986 -0.5878 -0.3146 -0.0682 -0.0196 0.1776 electronvolt
chargesum: -0.0000000
charge: -0.336663 -0.054421 -0.076330 -0.345267 -0.012340 0.290313 0.246111 -0.011976 0.252286 -0.347731 0.182170 0.352050 0.022663 0.145424 -0.211962 -0.177634 -0.177346 -0.208189 0.152008 -0.057324 0.282041 0.306069 0.057669 0.060523 0.183402 -0.202178 -0.200626 -0.180373 -0.177487 -0.179501 0.176424 0.208968 -0.651475 -0.284207 -0.280089 -0.597682 -0.428257 -0.595664 -0.558066 -0.620736 -0.341303 0.212482 0.161372 0.184319 0.163595 0.164811 0.167833 0.174111 0.174940 0.160717 0.164214 0.170161 0.156745 0.187066 0.167471 0.176977 0.187761 0.226926 0.362670 0.165278 0.174959 0.192461 0.154083 0.159965 0.185792
charge: -0.181336 -0.089852 -0.136281 -0.247895 -0.064280 -0.019072 -0.030484 -0.060317 -0.055560 -0.339115 0.208111 0.247022 0.228584 0.240838 -0.272486 -0.242391 -0.242410 -0.255767 0.131696 -0.124412 0.251386 0.252660 0.221733 0.225072 0.244688 -0.238739 -0.255772 -0.243117 -0.233090 -0.241884 -0.158421 -0.164508 -0.242016 -0.177070 -0.162502 -0.366173 -0.368220 -0.366997 -0.367216 -0.371872 -0.270081 0.191983 0.166309 0.179030 0.171588 0.170784 0.173479 0.178079 0.172446 0.171435 0.171281 0.171338 0.169042 0.179357 0.173964 0.178394 0.183812 0.183720 0.314403 0.172887 0.169854 0.181922 0.167204 0.171193 0.174041
qa: -0.3367 -0.0544 -0.0763 -0.3453 -0.0123 0.2903 0.2461 -0.0120 0.2523 -0.3477 0.1822 0.3520 0.0227 0.1454 -0.2120 -0.1776 -0.1773 -0.2082 0.1520 -0.0573 0.2820 0.3061 0.0577 0.0605 0.1834 -0.2022 -0.2006 -0.1804 -0.1775 -0.1795 0.1764 0.2090 -0.6515 -0.2842 -0.2801 -0.5977 -0.4283 -0.5957 -0.5581 -0.6207 -0.3413 0.2125 0.1614 0.1843 0.1636 0.1648 0.1678 0.1741 0.1749 0.1607 0.1642 0.1702 0.1567 0.1871 0.1675 0.1770 0.1878 0.2269 0.3627 0.1653 0.1750 0.1925 0.1541 0.1600 0.1858
va: 3.6992 3.1915 3.5094 3.6732 3.7808 3.4004 3.4734 3.6952 3.5332 4.3360 3.4532 3.3485 3.6905 3.6146 0.9792 1.0314 1.0330 0.9930 3.5177 3.5378 3.4950 3.6745 3.6992 3.6834 3.6290 1.0259 1.0161 1.0304 1.0427 1.0334 3.3367 3.2642 3.7224 3.8165 3.8268 3.7062 3.6865 3.7483 3.7122 3.7549 0.9469 0.9529 0.9560 0.9545 0.9620 0.9544 0.9626 0.9546 0.9540 0.9602 0.9612 0.9551 0.9633 0.9547 0.9550 0.9593 0.9532 0.9372 0.8830 0.9593 0.9564 0.9560 0.9729 0.9717 0.9550
dispersion: -0.040223330 hartree
energy: -2253.153420317733 hartree
dipole: -34.410838482 37.314759442 2.903920960 -52.849073576 55.031634725 2.182561149 2.497130273 -1.305774717 1.191355556
dipolemethod: SCF
magnitude: 3.823043051 au
magnitude: 9.717403182 debye
temp: 298.15 k
press: 1.00 atm
zeropoint: 0.46389972 hartree
thermalvibcorrection: 0.03737065 hartree
thermalrotcorrection: 0.00141627 hartree
thermaltrasncorrection: 0.00141627 hartree
thermaltotal: -2252.64931740 hartree
thermalcorr: 0.04020319 hartree
nonthermalcorr: 0.46389972 hartree
totalcorr: 0.50410292 hartree
thermalcorrenthalpy: 0.00094421 hartree
totalenthalpy: -2252.64837319 hartree
vibrat: 0.06654424 hartree
rotat: 0.01799082 hartree
transl: 0.02157821 hartree
total: 0.10611327 hartree
totalentropycorr: -0.10611327 hartree
gibbsenthalpy: -2252.75448646 hartree
gibbsminuselec: 0.39893386 hartree
