program: Orca
programVersion: 6.0.1
elementType: C C C C C C C C C Rh C C C C F F F F B C C C C C C F F F F F C C C C C C C C C C H H H H H H H H H H H H H H H H H H H H H H H
elementType: Rh
charge: 0
multiplicity: 1
keywords: r2scan0 D4 ma-def2-qzvp SP TIGHTSCF SMD(toluene)
formula: C29H23BF9Rh
InChI: InChI=1/C19H8BF9.C10H15.Rh/c21-10-5-9(12(22)16(26)13(10)23)20(8-4-6-1-2-7(8)3-6)11-14(24)17(27)19(29)18(28)15(11)25;1-6-7(2)9(4)10(5)8(6)3;/h1-2,4,6-8H,3H2;1-5H3;/rC29H23BF9Rh/c1-25-26(2)28(4)29(5)27(25,3)40(25,26,28,29)23-10-7-6-9(8-10)11(23)30(12-14(31)17(34)20(37)18(35)15(12)32)13-16(33)19(36)21(38)22(39)24(13)40/h6-7,9-11,23H,8H2,1-5H3
63 atoms
C  -0.38248 0.453006 2.559037
C  -1.09819 1.298477 -0.119613
C  -1.845563 0.096738 -0.249373
C  -1.300218 -0.757015 2.251452
C  2.053901 1.7519 -0.628614
C  2.135162 0.521499 0.170951
C  2.294112 2.820481 0.235756
C  2.626088 0.881655 1.501562
C  2.628355 2.282784 1.566927
Rh 0.537744 1.521238 1.056962
C  -1.418119 2.347485 -0.968199
C  -2.85054 0.031779 -1.21503
C  -3.169822 1.10407 -2.034117
C  -2.445665 2.282041 -1.901077
F  -0.741149 3.526745 -0.908006
F  -2.748985 3.332416 -2.672423
F  -4.16097 1.023859 -2.930383
F  -3.588988 -1.088552 -1.3745
B  -1.593918 -1.073826 0.741432
C  -1.683097 -2.576145 0.260851
C  -2.153348 -3.610677 1.075823
C  -1.248225 -2.976077 -1.00764
C  -2.201689 -4.938215 0.674196
C  -1.257051 -4.294245 -1.437904
C  -1.743392 -5.282334 -0.590761
F  -0.766901 -2.071908 -1.8781
F  -2.630363 -3.344553 2.303171
F  -2.681628 -5.884694 1.486311
F  -1.769685 -6.552374 -0.990078
F  -0.810921 -4.625669 -2.653368
C  -2.661512 -0.343466 2.999981
C  -1.31337 1.415581 3.402201
C  -2.688932 1.176205 2.761437
C  -1.487619 0.660951 4.708555
C  -2.29088 -0.385327 4.466973
C  1.737628 1.785682 -2.085134
C  2.08162 -0.860744 -0.379447
C  2.251187 4.27697 -0.074866
C  2.984946 3.137008 2.735923
C  3.028884 -0.089383 2.556487
H  -0.905382 -1.647391 2.755127
H  2.616838 1.491964 -2.672873
H  0.929595 1.089644 -2.329989
H  1.428645 2.781385 -2.408932
H  3.255423 4.715538 -0.008353
H  1.861125 4.463481 -1.076497
H  1.612963 4.814695 0.634632
H  3.99808 3.545287 2.62276
H  2.302245 3.988047 2.825755
H  2.951079 2.575512 3.672288
H  4.058749 -0.429578 2.388827
H  2.982302 0.353007 3.554928
H  2.385093 -0.974162 2.553363
H  3.076542 -1.160828 -0.738484
H  1.77091 -1.581444 0.382606
H  1.387255 -0.929888 -1.218983
H  0.452786 0.121583 3.18889
H  -0.96952 2.451031 3.491938
H  -3.495367 1.655916 3.325067
H  -2.738888 1.460502 1.709503
H  -0.931503 0.864569 5.617818
H  -2.524195 -1.2047 5.138472
H  -3.545327 -0.912229 2.704024
elementType: C Rh F B H
totalener: -2152.54376131772415 hartree
nucrepener: 5381.16664421615951 hartree
electener: -7533.68940048731110 hartree
twoeener: 6185.11962662419774 hartree
cpcmener: -0.01254533536757 hartree
kineticenergy: 2073.47387863903077 hartree
exchangeener: -198.732605928983 hartree
energy: -680.0575 -679.8586 -679.8575 -679.6704 -679.6524 -679.6002 -679.5075 -679.2711 -679.0674 -284.8454 -284.6249 -284.6232 -284.5425 -284.5410 -284.2517 -284.0596 -284.0090 -283.7026 -282.5288 -282.2763 -282.2019 -282.1737 -282.1429 -281.9719 -281.5385 -281.4502 -281.4100 -281.3743 -281.3208 -281.3146 -281.3033 -281.2492 -281.2449 -281.0477 -280.9940 -280.9371 -280.7917 -280.7021 -187.2050 -90.8805 -56.5791 -56.0600 -55.8995 -36.6799 -36.3851 -36.2486 -36.1832 -35.9583 -35.9255 -35.8721 -35.5278 -35.2999 -26.1499 -25.9911 -25.2869 -25.1764 -22.9476 -22.8470 -22.8151 -22.5806 -22.0335 -21.8620 -21.0988 -21.0331 -21.0111 -20.8052 -20.4659 -19.9663 -19.4883 -19.2150 -18.6489 -18.4927 -18.4168 -18.1055 -17.3887 -17.1080 -16.9425 -16.6604 -16.3773 -16.0726 -15.9972 -15.8514 -15.7996 -15.7250 -15.3739 -15.2622 -15.2177 -15.2015 -14.9990 -14.8147 -14.7552 -14.6512 -14.5671 -14.3566 -14.2959 -14.0379 -13.8322 -13.8220 -13.7893 -13.7523 -13.5961 -13.4091 -13.3912 -13.2902 -13.1663 -13.1354 -12.7868 -12.6386 -12.6050 -12.5715 -12.4275 -12.4167 -12.2670 -12.2194 -11.8597 -11.7574 -11.7114 -11.6291 -11.5371 -11.5215 -11.3924 -11.3598 -11.1493 -11.0518 -11.0051 -10.9874 -10.7304 -10.4523 -10.3978 -10.2222 -10.1252 -10.0372 -10.0251 -9.7268 -9.6811 -9.4346 -9.2676 -9.0771 -8.9605 -8.3305 -8.1057 -7.8980 -7.6561 -7.5565 -7.2575 -7.1051 -6.8630 -6.7441 -6.4432 -5.9796 -2.2562 -1.8726 -0.4284 -0.3367 -0.2935 -0.2430 0.0728 0.1848 0.2827 0.3020 0.3981 electronvolt
chargesum: -0.0000000
charge: -0.614225 -0.529062 0.226776 0.224648 -0.092544 0.139649 0.033303 -0.070120 -0.052547 1.268686 0.275013 0.222381 0.141367 0.212933 -0.321226 -0.269414 -0.271843 -0.319644 0.100055 -0.161888 0.310990 0.460705 0.058628 -0.071455 0.436372 -0.240557 -0.263773 -0.265615 -0.236695 -0.268587 -0.007783 0.083025 -0.010379 -0.160899 -0.155624 -0.134851 -0.111557 -0.192610 -0.172256 -0.198717 0.026185 0.044465 0.057432 0.050367 0.047356 0.047453 0.046856 0.052734 0.033976 0.044733 0.055585 0.051619 0.039595 0.043661 0.043804 0.042238 0.007192 0.034077 0.012412 0.022059 0.057374 0.064035 0.074135
charge: -0.054434 -0.128108 -0.024948 0.045558 -0.148360 -0.180786 -0.140740 -0.168808 -0.152832 0.609740 -0.434724 -0.358249 -0.380949 -0.380335 0.281736 0.357113 0.353079 0.332499 -0.449342 0.048492 -0.351178 -0.358246 -0.373519 -0.374078 -0.368454 0.340078 0.342557 0.363881 0.378375 0.364411 -0.014770 -0.077675 0.117551 0.070536 0.072320 0.235571 0.237131 0.229905 0.226873 0.223584 0.021515 -0.015222 -0.006594 -0.013084 -0.016570 -0.016334 -0.010927 -0.015276 -0.014550 -0.018911 -0.015075 -0.017701 -0.013356 -0.008070 -0.005899 -0.006473 -0.035018 -0.010070 -0.007512 -0.007354 -0.039382 -0.037235 -0.001354
qa: -0.6142 -0.5291 0.2268 0.2246 -0.0925 0.1396 0.0333 -0.0701 -0.0525 1.2687 0.2750 0.2224 0.1414 0.2129 -0.3212 -0.2694 -0.2718 -0.3196 0.1001 -0.1619 0.3110 0.4607 0.0586 -0.0715 0.4364 -0.2406 -0.2638 -0.2656 -0.2367 -0.2686 -0.0078 0.0830 -0.0104 -0.1609 -0.1556 -0.1349 -0.1116 -0.1926 -0.1723 -0.1987 0.0262 0.0445 0.0574 0.0504 0.0474 0.0475 0.0469 0.0527 0.0340 0.0447 0.0556 0.0516 0.0396 0.0437 0.0438 0.0422 0.0072 0.0341 0.0124 0.0221 0.0574 0.0640 0.0741
va: 4.1057 3.0163 2.4396 2.8955 3.3557 3.0449 3.3557 3.2544 3.3665 2.8611 3.2195 3.2990 3.4144 3.5208 0.8203 0.8860 0.8781 0.8646 2.8683 3.4785 3.2732 3.1755 3.6302 3.8354 3.3636 0.7661 0.8518 0.9239 0.9215 0.9314 3.6974 3.5423 3.6370 3.7403 3.6607 3.7480 3.6714 3.8188 3.8068 3.8034 0.9458 0.9974 0.9757 0.9926 0.9947 1.0019 0.9935 0.9977 0.9982 1.0015 0.9958 0.9906 0.9878 0.9961 0.9769 0.9934 0.9308 1.0081 0.9960 1.0793 1.0169 1.0170 0.9781
dispersion: -0.041656905 hartree
energy: -2152.585418222619 hartree
dipole: -31.145258482 34.516450347 3.371191865 -65.643879468 66.743981977 1.100102509 -8.437504486 9.691185250 1.253680765
dipolemethod: SCF
magnitude: 3.761233253 au
magnitude: 9.560295160 debye
