program: Orca
programVersion: 6.0.1
elementType: C C C C C C C C C Rh C C C C F F F F B C C C C C C F F F F F C C C C C C C C C C H H H H H H H H H H H H H H H H H H H H H H H
elementType: Rh
charge: 0
multiplicity: 1
keywords: OPTTS FREQ r2scan-3c
frequency: 0.00 0.00 0.00 0.00 0.00 0.00 -411.93 22.01 24.30 33.39 41.82 49.64 54.52 67.12 82.91 93.31 102.31 117.55 120.49 123.52 124.94 132.27 135.45 140.91 145.62 149.97 152.18 160.19 165.17 167.61 168.96 179.55 190.00 199.41 211.01 214.03 235.58 248.18 273.02 279.30 282.71 286.96 288.88 292.75 294.44 300.92 305.90 309.87 322.95 336.14 347.86 353.79 361.49 383.00 384.68 396.84 419.88 440.35 452.95 456.30 468.37 486.47 504.07 512.30 520.50 538.50 542.36 552.81 584.74 585.24 588.23 602.71 618.89 622.96 642.92 648.47 655.34 664.93 674.64 704.42 716.18 735.54 743.71 769.72 777.08 796.70 797.89 800.61 813.97 838.19 862.34 880.80 908.20 911.71 934.08 939.44 944.26 954.08 973.64 986.18 993.27 1000.28 1025.00 1030.94 1035.04 1035.64 1046.36 1047.67 1049.42 1064.53 1084.11 1086.34 1087.48 1110.79 1117.43 1119.44 1142.87 1149.13 1151.32 1160.49 1165.03 1173.16 1181.23 1217.65 1228.94 1239.98 1262.94 1268.57 1276.33 1292.84 1296.70 1333.15 1336.57 1341.41 1347.54 1354.50 1358.68 1384.50 1388.63 1403.97 1404.79 1406.53 1409.33 1413.05 1421.64 1453.92 1460.29 1462.55 1465.86 1468.89 1475.63 1476.53 1480.77 1482.14 1483.47 1486.47 1487.35 1505.81 1526.21 1532.12 1544.92 1584.80 1610.64 1631.97 1651.89 1655.03 2935.06 2997.62 2998.48 2999.67 3001.51 3004.23 3028.66 3058.01 3064.91 3068.42 3073.52 3075.18 3082.14 3110.94 3111.53 3112.08 3116.69 3118.26 3126.65 3131.54 3134.33 3180.70 3205.06
frequency: 22.01 24.30 33.39 41.82 49.64 54.52 67.12 82.91 93.31 102.31 117.55 120.49 123.52 124.94 132.27 135.45 140.91 145.62 149.97 152.18 160.19 165.17 167.61 168.96 179.55 190.00 199.41 211.01 214.03 235.58 248.18 273.02 279.30 282.71 286.96 288.88 292.75 294.44 300.92 305.90 309.87 322.95 336.14 347.86 353.79 361.49 383.00 384.68 396.84 419.88 440.35 452.95 456.30 468.37 486.47 504.07 512.30 520.50 538.50 542.36 552.81 584.74 585.24 588.23 602.71 618.89 622.96 642.92 648.47 655.34 664.93 674.64 704.42 716.18 735.54 743.71 769.72 777.08 796.70 797.89 800.61 813.97 838.19 862.34 880.80 908.20 911.71 934.08 939.44 944.26 954.08 973.64 986.18 993.27 1000.28 1025.00 1030.94 1035.04 1035.64 1046.36 1047.67 1049.42 1064.53 1084.11 1086.34 1087.48 1110.79 1117.43 1119.44 1142.87 1149.13 1151.32 1160.49 1165.03 1173.16 1181.23 1217.65 1228.94 1239.98 1262.94 1268.57 1276.33 1292.84 1296.70 1333.15 1336.57 1341.41 1347.54 1354.50 1358.68 1384.50 1388.63 1403.97 1404.79 1406.53 1409.33 1413.05 1421.64 1453.92 1460.29 1462.55 1465.86 1468.89 1475.63 1476.53 1480.77 1482.14 1483.47 1486.47 1487.35 1505.81 1526.21 1532.12 1544.92 1584.80 1610.64 1631.97 1651.89 1655.03 2935.06 2997.62 2998.48 2999.67 3001.51 3004.23 3028.66 3058.01 3064.91 3068.42 3073.52 3075.18 3082.14 3110.94 3111.53 3112.08 3116.69 3118.26 3126.65 3131.54 3134.33 3180.70 3205.06
formula: C29H23BF9Rh
InChI: InChI=1/C19H8BF9.C10H15.Rh/c21-10-5-9(12(22)16(26)13(10)23)20(8-4-6-1-2-7(8)3-6)11-14(24)17(27)19(29)18(28)15(11)25;1-6-7(2)9(4)10(5)8(6)3;/h1-2,4,6-8H,3H2;1-5H3;/rC29H23BF9Rh/c1-25-26(2)28(4)29(5)27(25,3)40(25,26,28,29)23-10-7-6-9(8-10)11(23)30(12-14(31)17(34)20(37)18(35)15(12)32)13-16(33)19(36)21(38)22(39)24(13)40/h6-7,9-11,23H,8H2,1-5H3
63 atoms
C  -0.949115 0.822388 2.270223
C  -1.18037 1.400215 0.445251
C  -1.71834 0.243998 -0.212924
C  -1.340248 -0.670966 2.107872
C  2.124946 1.263771 -0.574778
C  2.125269 0.303778 0.517709
C  2.518687 2.496932 -0.006358
C  2.761769 0.928422 1.694619
C  2.958615 2.267984 1.386885
Rh 0.698306 1.759331 1.022926
C  -1.757692 2.649871 0.162687
C  -2.702902 0.445222 -1.192006
C  -3.22375 1.690193 -1.476083
C  -2.736098 2.813865 -0.781694
F  -1.203302 3.748394 0.769508
F  -3.20036 4.027822 -1.103053
F  -4.226133 1.8511 -2.354727
F  -3.279865 -0.611955 -1.798459
B  -1.496797 -1.042589 0.577229
C  -1.493011 -2.500122 0.002498
C  -1.719912 -3.638191 0.786878
C  -1.161346 -2.768301 -1.334477
C  -1.676315 -4.933212 0.291767
C  -1.094319 -4.04825 -1.863688
C  -1.360561 -5.138988 -1.045098
F  -0.831526 -1.769703 -2.167652
F  -2.010543 -3.514338 2.092528
F  -1.927598 -5.981502 1.082346
F  -1.302436 -6.375194 -1.536692
F  -0.761982 -4.24861 -3.142662
C  -2.743463 -0.688142 2.889328
C  -2.147705 1.479941 3.039833
C  -3.34374 0.675688 2.500689
C  -2.023144 0.872615 4.427228
C  -2.377937 -0.416609 4.334085
C  1.727407 0.968255 -1.980472
C  1.876917 -1.154765 0.366757
C  2.608982 3.816139 -0.694607
C  3.500098 3.345353 2.264201
C  3.041108 0.207269 2.967851
H  -0.646813 -1.326694 2.650305
H  2.525078 0.429852 -2.508878
H  0.827003 0.345288 -2.012838
H  1.516567 1.885299 -2.535976
H  3.646799 4.033963 -0.981785
H  1.995906 3.838943 -1.598416
H  2.275335 4.628663 -0.041607
H  4.485563 3.676285 1.911103
H  2.84826 4.225593 2.264535
H  3.607648 3.009094 3.297678
H  3.863768 -0.508641 2.841679
H  3.315223 0.8956 3.770533
H  2.166681 -0.363885 3.302378
H  2.811582 -1.662292 0.088567
H  1.517383 -1.606514 1.295407
H  1.146063 -1.349869 -0.421565
H  -0.056698 0.899365 2.916265
H  -2.194008 2.568897 2.978924
H  -4.259613 0.885427 3.060555
H  -3.525012 0.798931 1.431583
H  -1.589778 1.375148 5.2858
H  -2.290781 -1.178735 5.101331
H  -3.351896 -1.571514 2.698192
totalener: -2152.63990181279860 hartree
nucrepener: 5400.82641259026241 hartree
electener: -7553.46631440306101 hartree
twoeener: 6204.57960672416903 hartree
kineticenergy: 2074.74036978557660 hartree
exchangeener: -265.004473674129 hartree
correlationener: -10.168197583226 hartree
xcener: -275.172671257355 hartree
dispersion: -0.038998060 hartree
dispersion: -0.038943265 hartree
dispersion: -0.038939005 hartree
energy: -667.6331 -667.4248 -667.3989 -667.2811 -667.2188 -667.1107 -667.0727 -666.8163 -666.7010 -276.4278 -276.2099 -276.1984 -276.1591 -276.1466 -275.8647 -275.5722 -275.4492 -275.4019 -274.5016 -274.2433 -274.1402 -274.1079 -274.0525 -274.0459 -273.9823 -273.6906 -273.5615 -273.5542 -273.4966 -273.4714 -273.4059 -273.3827 -273.2759 -272.9308 -272.9034 -272.8569 -272.8392 -272.8018 -179.9900 -86.6690 -53.5714 -52.9399 -52.4512 -33.5260 -33.2297 -33.1048 -32.9135 -32.8274 -32.7780 -32.5550 -32.4168 -32.1855 -24.0041 -23.5785 -23.2727 -22.7916 -20.9778 -20.9385 -20.5572 -20.3308 -20.1753 -19.7862 -19.3176 -19.2372 -19.0209 -18.9842 -18.6888 -18.1776 -17.4425 -17.1312 -16.8367 -16.6919 -16.5011 -16.4301 -15.4679 -15.1423 -15.0167 -14.8069 -14.7520 -14.4402 -14.0651 -14.0474 -14.0111 -13.8929 -13.8386 -13.8095 -13.4350 -13.3896 -13.3385 -13.2720 -13.0167 -12.8209 -12.6959 -12.5340 -12.4978 -12.3587 -12.2461 -12.0846 -12.0221 -11.8616 -11.7006 -11.6407 -11.4762 -11.4690 -11.4039 -11.2858 -11.1664 -11.0827 -10.9936 -10.9551 -10.9065 -10.7616 -10.6795 -10.6080 -10.5264 -10.4277 -10.4223 -10.3035 -10.2815 -10.1818 -9.9934 -9.9651 -9.9051 -9.7820 -9.5611 -9.4866 -9.2196 -9.1509 -9.1177 -9.0917 -9.0078 -8.9444 -8.8995 -8.7944 -8.5704 -8.3656 -8.2928 -8.1826 -7.6466 -7.2946 -7.1432 -6.9268 -6.4926 -6.4320 -6.2767 -6.0570 -5.9040 -5.5110 -5.3403 -4.1609 -3.1703 -2.6096 -1.2769 -1.0941 -1.0383 -0.8289 -0.5785 -0.2046 -0.0548 0.2066 0.4334 electronvolt
chargesum: -0.0000000
charge: -0.179122 -0.164006 -0.018330 -0.329560 0.005156 0.353108 0.219460 0.120499 0.098583 -0.249932 0.368215 0.276646 0.064819 0.172010 -0.251437 -0.182378 -0.187191 -0.208814 -0.022673 -0.096473 0.302282 0.282796 0.069849 0.066560 0.176565 -0.199556 -0.196804 -0.177901 -0.173864 -0.177431 0.148889 0.197332 -0.604217 -0.280571 -0.272191 -0.619630 -0.538719 -0.520480 -0.573420 -0.605015 0.207519 0.165015 0.186996 0.147820 0.169251 0.159361 0.158516 0.169341 0.162846 0.151096 0.169223 0.152305 0.165919 0.170828 0.174569 0.180157 0.175910 0.178531 0.178911 0.185922 0.155242 0.157366 0.184299
charge: -0.113518 -0.023000 -0.152140 -0.233179 -0.057517 -0.014527 -0.049540 -0.064435 -0.061237 -0.290949 0.203597 0.244857 0.200669 0.243260 -0.261619 -0.243038 -0.254170 -0.254753 0.055931 -0.131936 0.252683 0.243838 0.221610 0.223680 0.246089 -0.246393 -0.252098 -0.240991 -0.229996 -0.240168 -0.159957 -0.169117 -0.240999 -0.180794 -0.168709 -0.362061 -0.350915 -0.364159 -0.368480 -0.369519 0.184457 0.165981 0.181231 0.168822 0.170335 0.171285 0.172225 0.168430 0.170755 0.166143 0.167778 0.166450 0.169238 0.174838 0.176906 0.186862 0.217629 0.173825 0.170647 0.179738 0.167872 0.168379 0.173870
qa: -0.1791 -0.1640 -0.0183 -0.3296 0.0052 0.3531 0.2195 0.1205 0.0986 -0.2499 0.3682 0.2766 0.0648 0.1720 -0.2514 -0.1824 -0.1872 -0.2088 -0.0227 -0.0965 0.3023 0.2828 0.0698 0.0666 0.1766 -0.1996 -0.1968 -0.1779 -0.1739 -0.1774 0.1489 0.1973 -0.6042 -0.2806 -0.2722 -0.6196 -0.5387 -0.5205 -0.5734 -0.6050 0.2075 0.1650 0.1870 0.1478 0.1693 0.1594 0.1585 0.1693 0.1628 0.1511 0.1692 0.1523 0.1659 0.1708 0.1746 0.1802 0.1759 0.1785 0.1789 0.1859 0.1552 0.1574 0.1843
va: 3.6514 3.5272 3.5589 3.7539 3.8487 3.2416 3.5279 3.5867 3.6845 3.9040 3.4019 3.4853 3.6635 3.6431 0.9814 1.0308 1.0188 0.9999 3.7455 3.5048 3.5259 3.5834 3.6804 3.6722 3.6397 1.0135 1.0183 1.0320 1.0453 1.0340 3.3447 3.3386 3.7477 3.7798 3.8171 3.7647 3.5468 3.7087 3.7122 3.7173 0.9517 0.9554 0.9548 0.9670 0.9555 0.9647 0.9616 0.9549 0.9581 0.9671 0.9540 0.9667 0.9574 0.9582 0.9545 0.9588 0.9586 0.9592 0.9550 0.9577 0.9731 0.9725 0.9543
dispersion: -0.038941593 hartree
energy: -2152.649687079196 hartree
dipole: -40.999659679 43.747333304 2.747673625 -80.657020037 81.465310296 0.808290259 -6.943149259 8.113632010 1.170482751
dipolemethod: SCF
magnitude: 3.094038358 au
magnitude: 7.864420510 debye
temp: 298.15 k
press: 1.00 atm
zeropoint: 0.45001958 hartree
thermalvibcorrection: 0.03510751 hartree
thermalrotcorrection: 0.00141627 hartree
thermaltrasncorrection: 0.00141627 hartree
thermaltotal: -2152.16172744 hartree
thermalcorr: 0.03794006 hartree
nonthermalcorr: 0.45001958 hartree
totalcorr: 0.48795964 hartree
thermalcorrenthalpy: 0.00094421 hartree
totalenthalpy: -2152.16078323 hartree
vibrat: 0.06250120 hartree
rotat: 0.01792420 hartree
transl: 0.02153568 hartree
total: 0.10196108 hartree
totalentropycorr: -0.10196108 hartree
gibbsenthalpy: -2152.26274431 hartree
gibbsminuselec: 0.38694277 hartree
