program: Orca
programVersion: 6.0.1
elementType: C C C C C C C C C Rh C C C C F F F F B C C C C C C F F F F F C C C C C C C C C C H H H H H H H H H H H H H H H H H H H H H H H
elementType: Rh
charge: 0
multiplicity: 1
keywords: OPTTS FREQ r2scan-3c
frequency: 0.00 0.00 0.00 0.00 0.00 0.00 -411.85 15.46 26.74 29.37 32.41 44.54 56.48 69.60 80.25 101.94 111.33 117.32 120.95 132.92 137.36 139.55 144.59 150.60 152.43 156.67 163.48 167.93 172.02 176.87 182.54 192.84 199.56 212.42 215.19 231.50 236.98 256.64 277.90 279.01 282.31 288.10 289.78 293.31 294.74 303.94 310.09 319.86 329.58 347.23 352.09 366.20 367.32 376.68 383.01 384.46 407.58 438.58 453.92 462.40 468.91 490.04 500.73 517.42 522.41 532.21 542.07 555.11 581.85 586.10 587.64 603.96 615.71 618.14 641.39 644.65 650.56 665.34 676.98 690.88 699.11 707.95 725.29 749.65 770.36 789.83 790.63 797.83 801.05 803.35 829.02 888.82 895.17 914.66 925.54 934.19 945.65 953.20 958.81 982.13 985.71 988.82 1002.35 1030.02 1033.72 1034.58 1036.66 1048.45 1050.59 1073.80 1086.03 1088.49 1098.56 1114.30 1118.52 1120.85 1129.47 1140.53 1153.25 1160.22 1161.79 1173.90 1194.39 1230.06 1240.27 1264.90 1272.47 1290.26 1291.58 1312.52 1323.31 1335.13 1340.05 1344.27 1364.00 1367.75 1386.80 1390.69 1397.63 1405.66 1406.33 1409.35 1412.16 1418.39 1453.27 1460.35 1463.83 1465.61 1467.50 1475.02 1476.46 1478.67 1481.23 1481.80 1483.09 1488.41 1493.56 1500.54 1527.22 1529.50 1562.26 1612.20 1624.55 1632.99 1646.09 1657.68 2054.25 2987.55 3002.22 3002.45 3004.52 3004.87 3005.60 3038.98 3069.42 3074.61 3086.40 3089.14 3091.92 3106.83 3109.78 3119.54 3123.47 3125.16 3128.85 3138.26 3149.03 3182.80 3207.13
frequency: 15.46 26.74 29.37 32.41 44.54 56.48 69.60 80.25 101.94 111.33 117.32 120.95 132.92 137.36 139.55 144.59 150.60 152.43 156.67 163.48 167.93 172.02 176.87 182.54 192.84 199.56 212.42 215.19 231.50 236.98 256.64 277.90 279.01 282.31 288.10 289.78 293.31 294.74 303.94 310.09 319.86 329.58 347.23 352.09 366.20 367.32 376.68 383.01 384.46 407.58 438.58 453.92 462.40 468.91 490.04 500.73 517.42 522.41 532.21 542.07 555.11 581.85 586.10 587.64 603.96 615.71 618.14 641.39 644.65 650.56 665.34 676.98 690.88 699.11 707.95 725.29 749.65 770.36 789.83 790.63 797.83 801.05 803.35 829.02 888.82 895.17 914.66 925.54 934.19 945.65 953.20 958.81 982.13 985.71 988.82 1002.35 1030.02 1033.72 1034.58 1036.66 1048.45 1050.59 1073.80 1086.03 1088.49 1098.56 1114.30 1118.52 1120.85 1129.47 1140.53 1153.25 1160.22 1161.79 1173.90 1194.39 1230.06 1240.27 1264.90 1272.47 1290.26 1291.58 1312.52 1323.31 1335.13 1340.05 1344.27 1364.00 1367.75 1386.80 1390.69 1397.63 1405.66 1406.33 1409.35 1412.16 1418.39 1453.27 1460.35 1463.83 1465.61 1467.50 1475.02 1476.46 1478.67 1481.23 1481.80 1483.09 1488.41 1493.56 1500.54 1527.22 1529.50 1562.26 1612.20 1624.55 1632.99 1646.09 1657.68 2054.25 2987.55 3002.22 3002.45 3004.52 3004.87 3005.60 3038.98 3069.42 3074.61 3086.40 3089.14 3091.92 3106.83 3109.78 3119.54 3123.47 3125.16 3128.85 3138.26 3149.03 3182.80 3207.13
formula: C29H23BF9Rh
InChI: InChI=1/C19H7BF9.C10H15.Rh.H/c21-11-7-6-4-1-2-5(3-4)8(6)20(9(7)12(22)16(26)15(11)25)10-13(23)17(27)19(29)18(28)14(10)24;1-6-7(2)9(4)10(5)8(6)3;;/h1-2,4-6H,3H2;1-5H3;;/rC29H23BF9Rh/c1-24-25(2)27(4)28(5)26(24,3)40(24,25,27,28)29-10-7-6-9(8-10)12(29)11-13(16(32)20(36)19(35)15(11)31)30(29,40)14-17(33)21(37)23(39)22(38)18(14)34/h6-7,9-10,12,40H,8H2,1-5H3
63 atoms
C  -1.691049 1.204106 2.617707
C  -2.141146 1.901826 1.35899
C  -1.817431 1.180875 0.183524
C  -1.067183 -0.136459 2.122309
C  1.96409 0.155393 -0.639681
C  2.590636 -0.302009 0.602171
C  1.842376 1.550924 -0.545424
C  2.989819 0.871379 1.374229
C  2.475537 1.994292 0.70716
Rh 0.770038 0.616409 1.238633
C  -2.702316 3.160371 1.283007
C  -2.046227 1.79934 -1.038441
C  -2.615559 3.062709 -1.120769
C  -2.952163 3.747059 0.045389
F  -3.00296 3.855672 2.398715
F  -3.491706 4.968273 -0.03691
F  -2.828719 3.646194 -2.307206
F  -1.695602 1.196798 -2.194795
B  -1.226556 -0.228292 0.595405
C  -1.425635 -1.580792 -0.193638
C  -2.457991 -1.778557 -1.116094
C  -0.657493 -2.718917 0.058293
C  -2.671564 -2.977939 -1.784806
C  -0.831687 -3.933572 -0.587484
C  -1.847805 -4.064564 -1.524637
F  0.332106 -2.668556 0.975524
F  -3.343329 -0.798272 -1.364187
F  -3.675871 -3.105224 -2.659456
F  -2.041394 -5.227381 -2.152337
F  -0.038752 -4.978564 -0.311487
C  -1.561562 -1.187608 3.12911
C  -2.724892 0.676829 3.683477
C  -3.048494 -0.733823 3.146788
C  -1.841403 0.311965 4.868638
C  -1.144345 -0.77909 4.533632
C  1.583523 -0.708044 -1.793281
C  3.088627 -1.677706 0.876545
C  1.261404 2.486057 -1.549223
C  2.569984 3.42148 1.123995
C  3.81078 0.83789 2.620289
H  0.531051 0.125781 2.727588
H  2.427456 -0.806558 -2.4890
H  1.304517 -1.713175 -1.468469
H  0.734236 -0.291513 -2.339904
H  2.05935 3.057271 -2.041979
H  0.697065 1.955717 -2.317115
H  0.588452 3.211071 -1.078511
H  3.321679 3.947798 0.520476
H  1.61803 3.941863 0.977704
H  2.852134 3.517186 2.17471
H  4.880995 0.822592 2.374786
H  3.622368 1.711395 3.248651
H  3.592271 -0.053734 3.212594
H  4.174574 -1.703468 0.709071
H  2.905159 -1.971079 1.913462
H  2.625143 -2.419902 0.22737
H  -0.983157 1.862182 3.143589
H  -3.556008 1.357887 3.87732
H  -3.653892 -1.312252 3.851043
H  -3.507633 -0.735093 2.15219
H  -1.719012 0.923948 5.755923
H  -0.345014 -1.244272 5.1007
H  -1.363605 -2.219623 2.838193
totalener: -2152.69118276058816 hartree
nucrepener: 5476.03728941907411 hartree
electener: -7628.72847217966228 hartree
twoeener: 6279.48745446172688 hartree
kineticenergy: 2074.69188074467183 hartree
exchangeener: -265.000244643181 hartree
correlationener: -10.175500661155 hartree
xcener: -275.175745304336 hartree
dispersion: -0.039767213 hartree
dispersion: -0.039765320 hartree
dispersion: -0.039751737 hartree
dispersion: -0.039759603 hartree
dispersion: -0.039779421 hartree
dispersion: -0.039802379 hartree
dispersion: -0.039832117 hartree
dispersion: -0.039873785 hartree
dispersion: -0.039919824 hartree
dispersion: -0.039872623 hartree
dispersion: -0.039880964 hartree
dispersion: -0.039879589 hartree
energy: -667.3117 -667.2376 -667.2097 -667.1439 -667.1203 -667.0483 -666.9983 -666.8708 -666.8380 -276.0354 -275.9235 -275.8956 -275.8655 -275.8472 -275.8193 -275.7943 -275.6844 -275.5961 -274.7205 -274.4245 -274.3216 -274.3006 -274.2760 -273.7643 -273.6805 -273.6717 -273.5849 -273.5281 -273.5074 -273.4921 -273.4740 -273.4188 -273.4108 -273.4018 -273.2099 -273.0340 -273.0266 -273.0026 -179.3456 -87.1557 -54.0757 -53.2825 -52.9829 -33.2087 -33.0887 -32.9586 -32.7967 -32.7758 -32.5631 -32.5282 -32.4452 -32.3603 -24.2295 -23.5561 -23.2732 -23.0105 -21.1151 -21.0694 -20.9179 -20.2363 -20.0112 -19.9126 -19.3878 -19.3110 -19.1711 -19.0849 -18.7638 -18.1803 -17.1891 -16.9514 -16.8560 -16.8096 -16.6547 -16.5364 -15.2771 -15.1061 -15.0680 -14.7482 -14.6895 -14.5343 -14.1128 -14.0374 -13.9821 -13.9461 -13.7563 -13.6128 -13.5720 -13.4043 -13.2412 -13.0908 -12.9857 -12.8833 -12.7300 -12.6552 -12.4271 -12.3055 -12.1460 -12.0721 -11.9487 -11.8586 -11.6205 -11.5583 -11.5185 -11.4443 -11.3779 -11.3399 -11.2314 -11.1585 -11.0237 -10.7910 -10.7252 -10.6883 -10.6673 -10.6291 -10.5602 -10.5143 -10.5008 -10.4485 -10.2327 -10.1684 -10.0116 -9.9853 -9.9734 -9.7168 -9.6068 -9.4614 -9.3937 -9.2914 -9.2274 -9.1420 -9.1285 -8.9788 -8.8560 -8.6991 -8.5865 -8.4726 -8.3988 -8.3128 -8.1870 -7.2898 -7.1378 -6.7536 -6.6917 -6.4399 -6.2879 -6.1490 -6.1460 -5.9696 -5.6522 -4.6836 -3.4754 -1.7986 -1.1651 -1.0511 -0.8318 -0.7213 -0.6363 -0.5055 -0.1918 0.0456 0.1591 electronvolt
chargesum: -0.0000000
charge: -0.038830 -0.076604 0.149042 -0.351221 -0.082241 0.406539 0.266107 -0.008630 0.226363 -0.546731 0.093748 0.177949 0.119171 0.129214 -0.200429 -0.180543 -0.181351 -0.218140 0.240385 0.100911 0.313853 0.056800 0.034221 0.039297 0.169408 -0.194871 -0.200290 -0.179341 -0.181246 -0.183658 0.368654 0.159681 -0.608856 -0.247493 -0.306183 -0.654120 -0.503247 -0.623772 -0.548602 -0.580310 0.089853 0.165420 0.169846 0.179056 0.166175 0.185263 0.173765 0.172456 0.165185 0.156486 0.170245 0.152456 0.162070 0.164083 0.177633 0.170197 0.200476 0.178861 0.173652 0.180239 0.158047 0.150716 0.183185
charge: -0.128486 -0.030410 -0.067358 -0.120101 -0.041511 -0.011586 -0.049868 -0.068732 -0.042111 -0.381075 0.224340 0.220122 0.227167 0.231059 -0.264895 -0.243647 -0.245948 -0.260408 -0.088844 -0.092619 0.241512 0.219420 0.224168 0.215763 0.231764 -0.254085 -0.245999 -0.243420 -0.239268 -0.249271 -0.162468 -0.166602 -0.232477 -0.170003 -0.166991 -0.359763 -0.364133 -0.362411 -0.363090 -0.364180 0.219232 0.168576 0.176222 0.178419 0.170628 0.178456 0.176268 0.172341 0.174558 0.169819 0.166346 0.168241 0.171886 0.172614 0.179659 0.175760 0.196764 0.170736 0.168983 0.175020 0.169032 0.168677 0.178211
qa: -0.0388 -0.0766 0.1490 -0.3512 -0.0822 0.4065 0.2661 -0.0086 0.2264 -0.5467 0.0937 0.1779 0.1192 0.1292 -0.2004 -0.1805 -0.1814 -0.2181 0.2404 0.1009 0.3139 0.0568 0.0342 0.0393 0.1694 -0.1949 -0.2003 -0.1793 -0.1812 -0.1837 0.3687 0.1597 -0.6089 -0.2475 -0.3062 -0.6541 -0.5032 -0.6238 -0.5486 -0.5803 0.0899 0.1654 0.1698 0.1791 0.1662 0.1853 0.1738 0.1725 0.1652 0.1565 0.1702 0.1525 0.1621 0.1641 0.1776 0.1702 0.2005 0.1789 0.1737 0.1802 0.1580 0.1507 0.1832
va: 3.5118 3.3355 3.3096 3.7075 3.7961 3.2830 3.3719 3.7051 3.6234 4.2726 3.6613 3.6537 3.5675 3.6203 1.0120 1.0313 1.0279 0.9837 3.4745 3.3638 3.5375 3.7890 3.6669 3.7089 3.6095 0.9991 1.0071 1.0315 1.0379 1.0280 3.0395 3.3748 3.8186 3.8107 3.8478 3.7138 3.7412 3.5751 3.7047 3.7593 1.0091 0.9555 0.9588 0.9565 0.9563 0.9544 0.9570 0.9551 0.9596 0.9653 0.9547 0.9651 0.9603 0.9551 0.9555 0.9615 0.9574 0.9583 0.9548 0.9569 0.9717 0.9741 0.9579
dispersion: -0.039874441 hartree
energy: -2152.700879841397 hartree
dipole: -44.953054570 47.813035995 2.859981424 -19.124050573 19.761752947 0.637702374 -19.540512105 20.480288322 0.939776217
dipolemethod: SCF
magnitude: 3.077228851 au
magnitude: 7.821694139 debye
temp: 298.15 k
press: 1.00 atm
zeropoint: 0.44876282 hartree
thermalvibcorrection: 0.03484609 hartree
thermalrotcorrection: 0.00141627 hartree
thermaltrasncorrection: 0.00141627 hartree
thermaltotal: -2152.21443839 hartree
thermalcorr: 0.03767863 hartree
nonthermalcorr: 0.44876282 hartree
totalcorr: 0.48644145 hartree
thermalcorrenthalpy: 0.00094421 hartree
totalenthalpy: -2152.21349418 hartree
vibrat: 0.06190504 hartree
rotat: 0.01783270 hartree
transl: 0.02153568 hartree
total: 0.10127342 hartree
totalentropycorr: -0.10127342 hartree
gibbsenthalpy: -2152.31476760 hartree
gibbsminuselec: 0.38611224 hartree
