program: Orca
programVersion: 6.0.1
elementType: C C C C C C C C C Rh C C C C F F F F B C C C C C C F F F F F C C C C C C C C C C H H H H H H H H H H H H H H H H H H H H H H H
elementType: Rh
charge: 0
multiplicity: 1
keywords: OPTTS FREQ r2scan-3c
frequency: 0.00 0.00 0.00 0.00 0.00 0.00 -678.95 19.84 21.83 28.67 40.11 48.96 53.54 70.21 90.01 101.25 115.26 119.67 121.35 135.98 144.67 147.39 154.67 159.64 160.66 163.11 164.03 167.67 174.74 177.16 184.04 185.65 192.88 199.07 201.95 217.33 233.51 271.00 280.63 281.53 285.29 291.61 292.26 297.99 299.00 306.54 312.12 317.19 331.62 341.82 344.23 349.97 368.97 385.65 394.89 407.69 409.96 423.58 451.58 469.10 478.40 498.24 510.07 520.92 527.56 541.00 544.90 553.59 572.41 586.86 592.47 598.57 623.90 626.58 629.98 644.42 652.91 658.41 670.39 688.13 695.16 710.00 725.94 737.16 766.41 772.48 784.86 796.20 802.96 806.12 810.52 834.31 845.62 874.16 887.67 915.80 924.32 951.34 953.84 962.09 963.61 971.34 993.94 1008.25 1030.26 1033.32 1041.07 1048.58 1049.64 1051.91 1052.94 1086.94 1088.42 1108.19 1117.33 1120.90 1134.23 1143.04 1151.12 1156.74 1160.43 1170.53 1175.77 1189.57 1239.31 1255.07 1270.32 1283.48 1293.63 1311.69 1313.28 1340.81 1340.95 1351.89 1379.98 1383.80 1401.88 1403.92 1404.79 1408.19 1415.39 1421.55 1428.48 1437.05 1443.93 1452.48 1466.02 1470.09 1471.18 1476.88 1478.69 1484.21 1488.54 1489.38 1491.22 1495.11 1498.67 1500.17 1502.18 1520.85 1532.93 1626.60 1628.74 1635.71 1641.63 1660.91 2047.60 2190.46 3001.52 3003.21 3003.98 3004.95 3005.72 3029.29 3068.48 3081.59 3085.73 3086.49 3090.11 3100.97 3107.95 3119.08 3120.26 3121.96 3123.24 3125.81 3134.95 3188.81 3212.35
frequency: 19.84 21.83 28.67 40.11 48.96 53.54 70.21 90.01 101.25 115.26 119.67 121.35 135.98 144.67 147.39 154.67 159.64 160.66 163.11 164.03 167.67 174.74 177.16 184.04 185.65 192.88 199.07 201.95 217.33 233.51 271.00 280.63 281.53 285.29 291.61 292.26 297.99 299.00 306.54 312.12 317.19 331.62 341.82 344.23 349.97 368.97 385.65 394.89 407.69 409.96 423.58 451.58 469.10 478.40 498.24 510.07 520.92 527.56 541.00 544.90 553.59 572.41 586.86 592.47 598.57 623.90 626.58 629.98 644.42 652.91 658.41 670.39 688.13 695.16 710.00 725.94 737.16 766.41 772.48 784.86 796.20 802.96 806.12 810.52 834.31 845.62 874.16 887.67 915.80 924.32 951.34 953.84 962.09 963.61 971.34 993.94 1008.25 1030.26 1033.32 1041.07 1048.58 1049.64 1051.91 1052.94 1086.94 1088.42 1108.19 1117.33 1120.90 1134.23 1143.04 1151.12 1156.74 1160.43 1170.53 1175.77 1189.57 1239.31 1255.07 1270.32 1283.48 1293.63 1311.69 1313.28 1340.81 1340.95 1351.89 1379.98 1383.80 1401.88 1403.92 1404.79 1408.19 1415.39 1421.55 1428.48 1437.05 1443.93 1452.48 1466.02 1470.09 1471.18 1476.88 1478.69 1484.21 1488.54 1489.38 1491.22 1495.11 1498.67 1500.17 1502.18 1520.85 1532.93 1626.60 1628.74 1635.71 1641.63 1660.91 2047.60 2190.46 3001.52 3003.21 3003.98 3004.95 3005.72 3029.29 3068.48 3081.59 3085.73 3086.49 3090.11 3100.97 3107.95 3119.08 3120.26 3121.96 3123.24 3125.81 3134.95 3188.81 3212.35
formula: C29H23BF9Rh
InChI: InChI=1/C19H6BF9.C10H15.Rh.2H/c21-11-7-6-4-1-2-5(3-4)8(6)20(9(7)12(22)16(26)15(11)25)10-13(23)17(27)19(29)18(28)14(10)24;1-6-7(2)9(4)10(5)8(6)3;;;/h1-2,4-5H,3H2;1-5H3;;;/rC29H23BF9Rh/c1-9-10(2)26(4)27(5)25(9,3)40(26,27)28-11-6-7-12(8-11)29(28,40)30(14-13(28)16(31)20(35)21(36)17(14)32)15-18(33)22(37)24(39)23(38)19(15)34/h6-7,11-12H,8,40H2,1-5H3
63 atoms
C  -1.356311 1.018435 2.209386
C  -1.827959 1.762655 1.012716
C  -1.877107 0.910608 -0.128507
C  -1.194878 -0.388222 1.853637
C  1.81571 0.371839 -0.362318
C  2.594239 -0.133882 0.748269
C  1.613586 1.763399 -0.169656
C  2.890646 0.978216 1.616483
C  2.243359 2.136214 1.065417
Rh 0.74266 0.585687 1.743116
C  -2.169848 3.091909 0.909346
C  -2.232335 1.465719 -1.340661
C  -2.619647 2.805293 -1.444153
C  -2.589792 3.614598 -0.319412
F  -2.115149 3.918917 1.971179
F  -2.940338 4.899519 -0.415843
F  -2.986839 3.320944 -2.622993
F  -2.207064 0.748588 -2.478815
B  -1.499292 -0.539505 0.36738
C  -1.673309 -1.89829 -0.386949
C  -2.749092 -2.158282 -1.239683
C  -0.80609 -2.971801 -0.171981
C  -2.930691 -3.377267 -1.878662
C  -0.940558 -4.196871 -0.807743
C  -2.013916 -4.399905 -1.667035
F  0.232007 -2.8345 0.670043
F  -3.697566 -1.22942 -1.426154
F  -3.981604 -3.586157 -2.676311
F  -2.172779 -5.57672 -2.271244
F  -0.06245 -5.182969 -0.596018
C  -1.800977 -1.17789 3.038253
C  -2.13567 1.002691 3.565002
C  -3.031174 -0.241754 3.268972
C  -1.234172 0.402549 4.628087
C  -1.029683 -0.879122 4.312562
C  1.419407 -0.414066 -1.568817
C  3.213618 -1.490418 0.840123
C  0.944735 2.715279 -1.101601
C  2.330828 3.532356 1.587977
C  3.82798 0.961519 2.78029
H  0.926178 -0.26505 3.011752
H  2.191699 -0.325561 -2.344651
H  1.309483 -1.475494 -1.336479
H  0.476915 -0.062252 -1.996852
H  1.685251 3.364364 -1.587211
H  0.397427 2.192519 -1.888256
H  0.240637 3.367192 -0.573605
H  3.151377 4.070625 1.09511
H  1.408646 4.088285 1.396405
H  2.518582 3.548513 2.66382
H  4.848062 1.204999 2.454369
H  3.535257 1.689998 3.540272
H  3.853201 -0.02174 3.255263
H  4.210493 -1.484349 0.378179
H  3.328361 -1.807113 1.879471
H  2.612714 -2.244821 0.329998
H  0.110813 1.548005 2.840682
H  -2.631936 1.941552 3.815495
H  -3.644463 -0.531228 4.128089
H  -3.653615 -0.121618 2.374339
H  -0.749857 0.971045 5.414002
H  -0.355886 -1.574035 4.801148
H  -2.005552 -2.229353 2.827179
totalener: -2152.67061279807876 hartree
nucrepener: 5461.15784796046046 hartree
electener: -7613.82846075853922 hartree
twoeener: 6263.84777456790107 hartree
kineticenergy: 2074.65073985009349 hartree
exchangeener: -264.988759826677 hartree
correlationener: -10.180141418880 hartree
xcener: -275.168901245558 hartree
dispersion: -0.040231597 hartree
dispersion: -0.040257071 hartree
dispersion: -0.040224721 hartree
dispersion: -0.040254448 hartree
dispersion: -0.040254183 hartree
dispersion: -0.040260849 hartree
dispersion: -0.040264525 hartree
dispersion: -0.040267875 hartree
dispersion: -0.040271498 hartree
dispersion: -0.040278128 hartree
dispersion: -0.040291312 hartree
dispersion: -0.040311807 hartree
dispersion: -0.040346149 hartree
dispersion: -0.040396004 hartree
dispersion: -0.040402794 hartree
dispersion: -0.040431649 hartree
dispersion: -0.040423445 hartree
dispersion: -0.040404418 hartree
dispersion: -0.040396372 hartree
dispersion: -0.040397104 hartree
dispersion: -0.040402045 hartree
dispersion: -0.040400720 hartree
dispersion: -0.040408521 hartree
dispersion: -0.040410831 hartree
dispersion: -0.040402975 hartree
energy: -667.6351 -667.4847 -667.4515 -667.4222 -667.3125 -667.2964 -667.2232 -667.2110 -667.1038 -276.4378 -276.2356 -276.2287 -276.2144 -276.2107 -276.1867 -276.0174 -275.9432 -275.9184 -274.3962 -274.1282 -274.0705 -274.0439 -273.9206 -273.9007 -273.7543 -273.7409 -273.7330 -273.5498 -273.3865 -273.3423 -273.2986 -273.2712 -273.2627 -273.2548 -273.1505 -273.0535 -273.0193 -273.0104 -180.3343 -87.3090 -54.0179 -53.4022 -53.3349 -33.5380 -33.3184 -33.2585 -33.1178 -33.0035 -32.8595 -32.8060 -32.7523 -32.6222 -23.8832 -23.7489 -23.6278 -23.2043 -21.2381 -20.7365 -20.6940 -20.5848 -20.3712 -20.1498 -19.3685 -19.0592 -19.0094 -18.8256 -18.7544 -18.3014 -17.5089 -17.1758 -17.0430 -16.7939 -16.4956 -16.4035 -15.4968 -15.3077 -15.2213 -15.0887 -14.9853 -14.7433 -14.3048 -14.1990 -14.0852 -13.9297 -13.7667 -13.6418 -13.5981 -13.5294 -13.3918 -13.2139 -13.1727 -13.0628 -12.9804 -12.5776 -12.5134 -12.3324 -12.2531 -12.1857 -12.0338 -11.8779 -11.8197 -11.7317 -11.6402 -11.4973 -11.2956 -11.1780 -11.1495 -11.0332 -11.0165 -11.0056 -10.9634 -10.8677 -10.7495 -10.4711 -10.4291 -10.3717 -10.3050 -10.2677 -10.2629 -10.2443 -10.0078 -9.9427 -9.8983 -9.7404 -9.6766 -9.5466 -9.4527 -9.4409 -9.2267 -9.0866 -9.0209 -8.9752 -8.9310 -8.8102 -8.7890 -8.7540 -8.5148 -8.3585 -8.1960 -7.5988 -7.0760 -7.0154 -6.7730 -6.5550 -6.4703 -6.3898 -6.2806 -5.9124 -5.5138 -5.0448 -3.0391 -1.7853 -1.5431 -1.3432 -1.1429 -0.9225 -0.8479 -0.5646 -0.3306 0.2743 0.3347 electronvolt
chargesum: 0.0000000
charge: -0.260314 0.165122 0.054270 -0.083984 0.127378 0.248702 0.230889 0.077672 0.264168 -0.666182 0.044256 0.178185 0.122308 0.127608 -0.198990 -0.175815 -0.178617 -0.203347 0.168036 -0.076836 0.318340 0.208820 0.065862 0.060981 0.185863 -0.188385 -0.198299 -0.175478 -0.175194 -0.178088 0.284819 0.267967 -0.584168 -0.202578 -0.286029 -0.705617 -0.545527 -0.710435 -0.544957 -0.571302 0.097718 0.167163 0.169796 0.180243 0.161556 0.170554 0.175003 0.170710 0.158868 0.157247 0.164720 0.152454 0.154936 0.163902 0.158368 0.161156 0.128459 0.184260 0.175278 0.175334 0.153093 0.153325 0.174748
charge: -0.057658 -0.005667 -0.100745 -0.145543 -0.039192 -0.077306 -0.078537 -0.077804 -0.047998 -0.552660 0.216288 0.230551 0.220155 0.235553 -0.259959 -0.237154 -0.242760 -0.252603 0.082682 -0.117829 0.251895 0.239894 0.225340 0.221445 0.243597 -0.243880 -0.240669 -0.238563 -0.231339 -0.242184 -0.151962 -0.160130 -0.220075 -0.172623 -0.156146 -0.364553 -0.368538 -0.363457 -0.366387 -0.365396 0.190322 0.170056 0.173625 0.175758 0.168100 0.173227 0.174762 0.168702 0.170634 0.169353 0.163967 0.168031 0.169264 0.164264 0.170325 0.171016 0.245853 0.173348 0.167020 0.169922 0.171027 0.171527 0.171818
qa: -0.2603 0.1651 0.0543 -0.0840 0.1274 0.2487 0.2309 0.0777 0.2642 -0.6662 0.0443 0.1782 0.1223 0.1276 -0.1990 -0.1758 -0.1786 -0.2033 0.1680 -0.0768 0.3183 0.2088 0.0659 0.0610 0.1859 -0.1884 -0.1983 -0.1755 -0.1752 -0.1781 0.2848 0.2680 -0.5842 -0.2026 -0.2860 -0.7056 -0.5455 -0.7104 -0.5450 -0.5713 0.0977 0.1672 0.1698 0.1802 0.1616 0.1706 0.1750 0.1707 0.1589 0.1572 0.1647 0.1525 0.1549 0.1639 0.1584 0.1612 0.1285 0.1843 0.1753 0.1753 0.1531 0.1533 0.1747
va: 3.9101 3.1488 3.3469 3.6367 3.5644 3.4360 3.3363 3.7014 3.5904 4.8248 3.6897 3.6002 3.5905 3.6597 1.0082 1.0374 1.0338 1.0040 3.5797 3.5108 3.5972 3.6026 3.6788 3.6890 3.6301 1.0171 1.0194 1.0345 1.0455 1.0321 3.1534 3.0972 3.8508 3.7938 3.8812 3.6829 3.7505 3.7032 3.7174 3.7747 1.0170 0.9559 0.9558 0.9536 0.9572 0.9536 0.9523 0.9555 0.9612 0.9637 0.9561 0.9638 0.9640 0.9555 0.9625 0.9649 0.9981 0.9554 0.9551 0.9558 0.9721 0.9720 0.9600
dispersion: -0.040403389 hartree
energy: -2152.691920301762 hartree
dipole: -42.779540207 44.495530315 1.715990107 -15.833613022 16.229147156 0.395534134 -47.574365204 48.387820755 0.813455552
dipolemethod: SCF
magnitude: 1.939788451 au
magnitude: 4.930550405 debye
temp: 298.15 k
press: 1.00 atm
zeropoint: 0.44613334 hartree
thermalvibcorrection: 0.03479280 hartree
thermalrotcorrection: 0.00141627 hartree
thermaltrasncorrection: 0.00141627 hartree
thermaltotal: -2152.20816162 hartree
thermalcorr: 0.03762534 hartree
nonthermalcorr: 0.44613334 hartree
totalcorr: 0.48375868 hartree
thermalcorrenthalpy: 0.00094421 hartree
totalenthalpy: -2152.20721741 hartree
vibrat: 0.06161022 hartree
rotat: 0.01785726 hartree
transl: 0.02153568 hartree
total: 0.10100315 hartree
totalentropycorr: -0.10100315 hartree
gibbsenthalpy: -2152.30822056 hartree
gibbsminuselec: 0.38369974 hartree
