program: Orca
programVersion: 6.0.1
elementType: C C C C C C C C C Rh C C C C F F F F B C C C C C C F F F F F C C C C C C C C C C H H H H H H H H H H H H H H H H H H H H H H H
elementType: Rh
charge: 0
multiplicity: 1
keywords: r2scan0 D4 ma-def2-qzvp SP TIGHTSCF SMD(toluene)
formula: C29H23BF9Rh
InChI: InChI=1/C19H6BF9.C10H15.Rh.2H/c21-11-7-6-4-1-2-5(3-4)8(6)20(9(7)12(22)16(26)15(11)25)10-13(23)17(27)19(29)18(28)14(10)24;1-6-7(2)9(4)10(5)8(6)3;;;/h1-2,4-5H,3H2;1-5H3;;;/rC29H23BF9Rh/c1-9-10(2)26(4)27(5)25(9,3)40(26,27)28-11-6-7-12(8-11)29(28,40)30(14-13(28)16(31)20(35)21(36)17(14)32)15-18(33)22(37)24(39)23(38)19(15)34/h6-7,11-12H,8,40H2,1-5H3
63 atoms
C  -1.356311 1.018435 2.209386
C  -1.827959 1.762655 1.012716
C  -1.877107 0.910608 -0.128507
C  -1.194878 -0.388222 1.853637
C  1.81571 0.371839 -0.362318
C  2.594239 -0.133882 0.748269
C  1.613586 1.763399 -0.169656
C  2.890646 0.978216 1.616483
C  2.243359 2.136214 1.065417
Rh 0.74266 0.585687 1.743116
C  -2.169848 3.091909 0.909346
C  -2.232335 1.465719 -1.340661
C  -2.619647 2.805293 -1.444153
C  -2.589792 3.614598 -0.319412
F  -2.115149 3.918917 1.971179
F  -2.940338 4.899519 -0.415843
F  -2.986839 3.320944 -2.622993
F  -2.207064 0.748588 -2.478815
B  -1.499292 -0.539505 0.36738
C  -1.673309 -1.89829 -0.386949
C  -2.749092 -2.158282 -1.239683
C  -0.80609 -2.971801 -0.171981
C  -2.930691 -3.377267 -1.878662
C  -0.940558 -4.196871 -0.807743
C  -2.013916 -4.399905 -1.667035
F  0.232007 -2.8345 0.670043
F  -3.697566 -1.22942 -1.426154
F  -3.981604 -3.586157 -2.676311
F  -2.172779 -5.57672 -2.271244
F  -0.06245 -5.182969 -0.596018
C  -1.800977 -1.17789 3.038253
C  -2.13567 1.002691 3.565002
C  -3.031174 -0.241754 3.268972
C  -1.234172 0.402549 4.628087
C  -1.029683 -0.879122 4.312562
C  1.419407 -0.414066 -1.568817
C  3.213618 -1.490418 0.840123
C  0.944735 2.715279 -1.101601
C  2.330828 3.532356 1.587977
C  3.82798 0.961519 2.78029
H  0.926178 -0.26505 3.011752
H  2.191699 -0.325561 -2.344651
H  1.309483 -1.475494 -1.336479
H  0.476915 -0.062252 -1.996852
H  1.685251 3.364364 -1.587211
H  0.397427 2.192519 -1.888256
H  0.240637 3.367192 -0.573605
H  3.151377 4.070625 1.09511
H  1.408646 4.088285 1.396405
H  2.518582 3.548513 2.66382
H  4.848062 1.204999 2.454369
H  3.535257 1.689998 3.540272
H  3.853201 -0.02174 3.255263
H  4.210493 -1.484349 0.378179
H  3.328361 -1.807113 1.879471
H  2.612714 -2.244821 0.329998
H  0.110813 1.548005 2.840682
H  -2.631936 1.941552 3.815495
H  -3.644463 -0.531228 4.128089
H  -3.653615 -0.121618 2.374339
H  -0.749857 0.971045 5.414002
H  -0.355886 -1.574035 4.801148
H  -2.005552 -2.229353 2.827179
elementType: C Rh F B H
totalener: -2152.53419589675286 hartree
nucrepener: 5467.02005107229161 hartree
electener: -7619.53491525325353 hartree
twoeener: 6269.33475586682562 hartree
cpcmener: -0.01181636398973 hartree
kineticenergy: 2073.31650598103897 hartree
exchangeener: -198.692982854378 hartree
energy: -680.0528 -679.8953 -679.8706 -679.8612 -679.7372 -679.6707 -679.6514 -679.5894 -679.5058 -284.8337 -284.6246 -284.6162 -284.5933 -284.5681 -284.5561 -284.3820 -284.3246 -284.2635 -282.6401 -282.4273 -282.1567 -282.1526 -282.0275 -282.0013 -281.9805 -281.8443 -281.8074 -281.6578 -281.6423 -281.3385 -281.2506 -281.2461 -281.1913 -281.1881 -281.1802 -281.1323 -281.1320 -281.1129 -187.1349 -91.3455 -56.9791 -56.4852 -56.4540 -36.6768 -36.4633 -36.3946 -36.2509 -36.1461 -35.9723 -35.9404 -35.8627 -35.7552 -26.1883 -26.0029 -25.9439 -25.5142 -23.4406 -22.8051 -22.7112 -22.6753 -22.5936 -22.3526 -21.4451 -20.8981 -20.8646 -20.7394 -20.6452 -20.2580 -19.5573 -19.2298 -19.0568 -18.7676 -18.1619 -18.0648 -17.4003 -17.1609 -17.1287 -17.0359 -16.8919 -16.6144 -16.1373 -15.9494 -15.8721 -15.7451 -15.5662 -15.3823 -15.1708 -15.1566 -15.0833 -15.0325 -14.9694 -14.6944 -14.6732 -14.5867 -14.4107 -14.2766 -14.0543 -13.8910 -13.8423 -13.7319 -13.7113 -13.6048 -13.5042 -13.2925 -13.1903 -13.1297 -13.0263 -12.9234 -12.7460 -12.4239 -12.3891 -12.2677 -12.2489 -12.2130 -12.1212 -11.7964 -11.6518 -11.6028 -11.4345 -11.4173 -11.4041 -11.3683 -11.3239 -11.1770 -11.0492 -10.8737 -10.8565 -10.7887 -10.6385 -10.3792 -10.2577 -10.1867 -10.1800 -10.0364 -9.8809 -9.8594 -9.6330 -9.5452 -9.3207 -8.7167 -8.2185 -8.1210 -7.8601 -7.6607 -7.5681 -7.5205 -7.4492 -6.9467 -6.3009 -5.8590 -2.3373 -0.9665 -0.6938 -0.5206 -0.3680 -0.3129 -0.1176 0.0656 0.2205 0.2834 0.3776 electronvolt
chargesum: -0.0000000
charge: 0.300787 0.007428 0.159957 -0.180300 -0.027190 -0.115226 -0.120365 -0.105870 -0.187508 1.470384 -0.171765 0.100700 0.158638 0.339309 -0.313428 -0.263667 -0.279202 -0.251972 -0.170227 0.158721 0.414970 0.287410 -0.005808 -0.039108 0.407552 -0.219710 -0.271785 -0.261921 -0.239411 -0.267273 -0.015745 -0.124040 -0.002677 -0.170725 -0.115798 -0.157346 -0.157568 -0.137673 -0.141632 -0.148681 0.009579 0.032786 0.034319 0.045542 0.031521 0.042864 0.035491 0.055198 0.043210 0.041125 0.047892 0.033226 0.039603 0.042683 0.037885 0.042076 -0.031955 0.056117 0.034154 0.014409 0.062971 0.046915 0.060155
charge: -0.142719 -0.077340 0.046078 -0.073617 -0.144159 -0.183535 -0.151655 -0.202855 -0.171458 0.725824 -0.373879 -0.374653 -0.380596 -0.378554 0.331984 0.366818 0.358538 0.334236 -0.514412 0.043939 -0.353487 -0.368216 -0.372513 -0.376567 -0.369257 0.329506 0.357801 0.365498 0.376263 0.362043 -0.024702 -0.017896 0.151903 0.065714 0.069201 0.237037 0.221200 0.230826 0.226460 0.216345 -0.069155 -0.011144 -0.009625 -0.006109 -0.012922 -0.009139 -0.007514 -0.015216 -0.014756 -0.018525 -0.018974 -0.020760 -0.019975 -0.017438 -0.017059 -0.019294 0.006159 -0.005434 -0.010975 0.002209 -0.035718 -0.032870 -0.000912
qa: 0.3008 0.0074 0.1600 -0.1803 -0.0272 -0.1152 -0.1204 -0.1059 -0.1875 1.4704 -0.1718 0.1007 0.1586 0.3393 -0.3134 -0.2637 -0.2792 -0.2520 -0.1702 0.1587 0.4150 0.2874 -0.0058 -0.0391 0.4076 -0.2197 -0.2718 -0.2619 -0.2394 -0.2673 -0.0157 -0.1240 -0.0027 -0.1707 -0.1158 -0.1573 -0.1576 -0.1377 -0.1416 -0.1487 0.0096 0.0328 0.0343 0.0455 0.0315 0.0429 0.0355 0.0552 0.0432 0.0411 0.0479 0.0332 0.0396 0.0427 0.0379 0.0421 -0.0320 0.0561 0.0342 0.0144 0.0630 0.0469 0.0602
va: 2.8234 3.2474 2.3229 2.6364 3.2882 3.2560 3.6254 3.2651 3.2109 2.3435 3.4098 3.3541 3.4748 3.3572 0.8635 0.8914 0.9008 0.8128 3.0580 3.0264 3.0906 3.4591 3.6460 3.8236 3.4036 0.7701 0.8727 0.9240 0.9192 0.9291 3.5211 3.7498 3.6491 3.8040 3.7710 3.7194 3.7405 3.6728 3.7396 3.7530 1.1115 0.9902 0.9965 0.9836 0.9985 0.9870 0.9938 0.9962 0.9906 0.9931 0.9971 0.9955 0.9964 0.9970 0.9944 0.9986 1.1166 0.9947 0.9879 1.0218 1.0115 1.0148 0.9918
dispersion: -0.043523973 hartree
energy: -2152.577719869630 hartree
dipole: -42.779540207 44.697431812 1.917891605 -15.833613022 16.287801455 0.454188433 -47.574365204 48.418117503 0.843752300
dipolemethod: SCF
magnitude: 2.143948060 au
magnitude: 5.449482891 debye
