program: Orca
programVersion: 6.0.1
elementType: C C C C C C C C C Rh C C C C F F F F B C C C C C C F F F F F C C C C C C C C C C H H H H H H H H H H H H H H H H H H H H H H H
elementType: Rh
charge: 0
multiplicity: 1
keywords: r2scan0 D4 ma-def2-qzvp SP TIGHTSCF SMD(toluene)
formula: C29H23BF9Rh
InChI: InChI=1/C19H6BF9.C10H15.Rh.2H/c21-11-7-6-4-1-2-5(3-4)8(6)20(9(7)12(22)16(26)15(11)25)10-13(23)17(27)19(29)18(28)14(10)24;1-6-7(2)9(4)10(5)8(6)3;;;/h1-2,4-5H,3H2;1-5H3;;;/rC29H23BF9Rh/c1-7-8(2)28(4)29(5)27(7,3)40(28,29)25-9-6-10(26(25)40)13-11(9)12-14(17(32)21(36)20(35)16(12)31)30(13)15-18(33)22(37)24(39)23(38)19(15)34/h9-10,25-26H,6,40H2,1-5H3
63 atoms
C  -1.812373 0.58385 1.691363
C  -1.880261 1.433144 0.503934
C  -1.607442 0.627663 -0.638258
C  -1.370637 -0.68335 1.42951
C  2.045378 0.443078 0.933174
C  2.756396 -0.242591 1.986577
C  2.02849 1.82392 1.243227
C  3.266569 0.743219 2.888366
C  2.771426 2.025951 2.462793
Rh 1.079046 0.746357 3.173662
C  -2.098863 2.781711 0.381818
C  -1.514788 1.242089 -1.858192
C  -1.733633 2.627675 -1.99732
C  -2.0294 3.388937 -0.884141
F  -2.350548 3.561649 1.44605
F  -2.229233 4.702881 -1.004142
F  -1.645628 3.205462 -3.198354
F  -1.190257 0.566217 -2.971765
B  -1.376725 -0.854481 -0.095876
C  -1.471809 -2.186012 -0.898706
C  -2.318837 -2.346157 -2.000493
C  -0.753343 -3.324021 -0.518761
C  -2.429344 -3.540511 -2.698245
C  -0.823653 -4.52828 -1.200331
C  -1.672592 -4.635311 -2.297084
F  0.08026 -3.264227 0.533236
F  -3.105955 -1.337961 -2.394518
F  -3.261536 -3.656236 -3.735392
F  -1.764793 -5.787338 -2.956585
F  -0.095689 -5.581696 -0.820132
C  -1.392011 -1.403818 2.757664
C  -2.217628 0.686062 3.13697
C  -2.70961 -0.786014 3.343981
C  -0.927321 0.590185 3.988451
C  -0.376929 -0.720178 3.732412
C  1.576102 -0.206031 -0.314923
C  3.090486 -1.699321 1.98312
C  1.457359 2.925336 0.412155
C  3.159927 3.354867 3.027941
C  4.252516 0.503636 3.986718
H  1.407547 0.741052 4.680189
H  2.35983 -0.843845 -0.741611
H  0.71639 -0.873217 -0.127653
H  1.274324 0.520594 -1.071103
H  2.258596 3.480855 -0.093086
H  0.777668 2.543621 -0.352884
H  0.901442 3.642157 1.024332
H  4.067689 3.737397 2.540872
H  2.368666 4.095461 2.88329
H  3.358809 3.290218 4.100445
H  5.275416 0.558201 3.591028
H  4.158828 1.249317 4.779314
H  4.120221 -0.482977 4.437264
H  3.990791 -1.890837 1.382406
H  3.281487 -2.068216 2.993843
H  2.275202 -2.291289 1.559643
H  0.005878 1.850004 3.589284
H  -2.890353 1.501837 3.405206
H  -2.86815 -1.027763 4.401916
H  -3.604657 -1.031377 2.759571
H  -1.012746 0.966771 5.005207
H  -0.0243 -1.338692 4.553393
H  -1.324049 -2.491575 2.728059
elementType: C Rh F B H
totalener: -2152.51484371940160 hartree
nucrepener: 5334.77028716474524 hartree
electener: -7487.26646088821508 hartree
twoeener: 6136.93832909336197 hartree
cpcmener: -0.01100712630608 hartree
kineticenergy: 2073.31911958594810 hartree
exchangeener: -198.691462919186 hartree
energy: -680.1854 -679.9995 -679.9700 -679.9349 -679.8674 -679.8590 -679.8048 -679.7159 -679.6166 -285.0142 -284.8090 -284.8076 -284.7090 -284.6926 -284.6769 -284.5670 -284.4935 -284.4696 -282.4594 -282.3260 -282.2978 -282.2127 -281.9641 -281.7992 -281.7693 -281.7511 -281.7204 -281.6612 -281.5849 -281.5730 -281.5068 -281.3505 -281.2403 -281.0837 -281.0329 -281.0182 -281.0094 -280.9982 -187.6628 -90.9195 -56.6048 -56.0315 -56.0143 -36.8146 -36.5626 -36.5284 -36.4008 -36.2728 -36.1317 -36.0887 -36.0014 -35.8882 -26.3264 -26.1507 -25.6959 -25.6317 -23.5744 -22.9495 -22.7530 -22.5144 -22.4766 -22.4281 -21.6826 -20.8793 -20.7658 -20.6717 -20.4839 -20.3980 -19.7213 -19.3781 -19.1689 -18.9051 -17.9748 -17.8121 -17.5539 -17.3777 -17.2893 -17.1467 -17.0441 -16.7406 -16.3025 -16.1529 -16.0153 -15.9087 -15.6878 -15.5159 -15.3978 -15.2347 -15.1365 -14.9036 -14.8377 -14.8231 -14.7639 -14.5376 -14.5171 -14.3915 -14.0681 -13.9655 -13.9371 -13.8101 -13.7217 -13.5814 -13.3673 -13.3116 -13.2690 -13.1601 -13.0985 -12.9054 -12.5646 -12.4723 -12.3617 -12.3155 -12.2719 -12.1962 -12.0783 -12.0474 -11.5710 -11.5261 -11.5004 -11.4673 -11.4520 -11.3392 -11.2808 -11.0098 -10.9956 -10.8635 -10.7713 -10.7392 -10.7056 -10.4890 -10.4161 -10.1910 -9.9721 -9.8907 -9.8610 -9.6533 -9.6047 -9.4629 -9.2087 -8.7161 -8.1372 -8.1094 -7.9142 -7.7088 -7.6571 -7.4768 -7.3929 -6.4978 -5.9621 -5.7401 -2.9019 -0.8978 -0.5633 -0.4939 -0.4536 -0.4206 -0.3155 -0.0439 0.2718 0.3229 0.3997 electronvolt
chargesum: -0.0000000
charge: -0.254622 0.585770 -0.070372 0.032280 0.073465 -0.172551 -0.152325 -0.200249 -0.009819 0.849564 -0.106038 0.178772 0.200708 0.357005 -0.302806 -0.259230 -0.260897 -0.261793 0.066625 -0.108460 0.277918 0.381732 0.045627 -0.075864 0.465003 -0.238339 -0.260964 -0.259846 -0.232059 -0.268669 0.155547 -0.051502 -0.021694 -0.059099 -0.179718 -0.086842 -0.142712 -0.120447 -0.146240 -0.125137 -0.030635 -0.004680 -0.000748 0.046654 0.038334 0.005435 0.035939 0.043836 0.028254 0.031541 0.051698 0.035628 0.035408 0.048778 0.033582 0.046115 0.035790 0.076560 0.039523 0.011251 0.066132 0.031764 0.052117
charge: -0.009517 -0.063632 0.054429 0.060895 -0.153201 -0.185042 -0.161925 -0.212020 -0.199327 0.651960 -0.366399 -0.370548 -0.373115 -0.375376 0.341169 0.369630 0.365390 0.346240 -0.505620 0.044597 -0.348909 -0.353335 -0.370704 -0.371838 -0.364522 0.333464 0.363460 0.368797 0.382156 0.366688 -0.023841 -0.003938 0.159490 -0.051966 -0.043189 0.253178 0.215935 0.223594 0.205949 0.211675 -0.088846 -0.003848 0.004402 -0.003621 -0.014130 -0.012841 -0.009748 -0.021624 -0.021638 -0.023171 -0.019525 -0.022919 -0.021926 -0.018580 -0.019111 -0.013381 -0.026647 -0.002170 -0.008489 -0.009050 -0.013034 -0.036802 -0.004034
qa: -0.2546 0.5858 -0.0704 0.0323 0.0735 -0.1726 -0.1523 -0.2002 -0.0098 0.8496 -0.1060 0.1788 0.2007 0.3570 -0.3028 -0.2592 -0.2609 -0.2618 0.0666 -0.1085 0.2779 0.3817 0.0456 -0.0759 0.4650 -0.2383 -0.2610 -0.2598 -0.2321 -0.2687 0.1555 -0.0515 -0.0217 -0.0591 -0.1797 -0.0868 -0.1427 -0.1204 -0.1462 -0.1251 -0.0306 -0.0047 -0.0007 0.0467 0.0383 0.0054 0.0359 0.0438 0.0283 0.0315 0.0517 0.0356 0.0354 0.0488 0.0336 0.0461 0.0358 0.0766 0.0395 0.0113 0.0661 0.0318 0.0521
va: 3.7278 2.3380 2.8560 2.2920 3.3521 3.3490 3.6092 3.4661 3.0455 3.6647 3.5116 3.3556 3.4962 3.3699 0.8777 0.9008 0.9009 0.8386 2.6842 2.9790 3.2120 3.2854 3.6574 3.8184 3.3441 0.8422 0.8832 0.9345 0.9300 0.9427 3.3160 3.5241 3.6317 3.8690 3.6658 3.7551 3.7400 3.7516 3.7224 3.7232 1.0815 1.0012 1.0837 0.9749 0.9922 1.0365 0.9702 0.9996 1.0002 0.9955 0.9960 0.9896 0.9938 0.9985 0.9928 0.9917 1.1191 0.9788 0.9993 1.0129 1.0010 1.0420 0.9788
dispersion: -0.041971076 hartree
energy: -2152.556814795431 hartree
dipole: -43.770677938 44.271443665 0.500765727 -33.387758972 33.206548705 -0.181210267 -106.430485063 107.666970902 1.236485838
dipolemethod: SCF
magnitude: 1.346291463 au
magnitude: 3.422000947 debye
