program: Orca
programVersion: 6.0.1
elementType: C C C C C C C C C Rh C C C C F F F F B C C C C C C F F F F F C C C C C C C C C C H H H H H H H H H H H H H H H H H H H H H H H
elementType: Rh
charge: 0
multiplicity: 1
keywords: OPTTS FREQ r2scan-3c
frequency: 0.00 0.00 0.00 0.00 0.00 0.00 -785.89 20.44 28.91 31.93 41.13 43.05 46.84 68.81 72.12 85.05 107.26 119.89 122.81 138.21 142.19 146.77 152.07 153.34 155.12 159.82 162.50 166.76 169.85 179.15 184.00 187.37 190.54 202.22 214.55 222.23 255.79 264.42 280.65 281.36 285.05 290.53 292.33 296.68 299.19 304.68 308.09 315.47 317.75 322.08 342.40 351.83 360.68 383.70 385.89 406.52 413.98 429.42 449.93 452.66 475.80 486.49 496.71 507.52 519.23 528.23 536.07 543.47 551.72 579.11 585.12 588.40 608.58 613.13 628.11 638.60 649.08 651.62 655.01 661.48 686.68 701.22 732.98 762.03 771.95 774.83 795.08 797.17 799.57 800.58 832.54 872.81 882.61 905.80 910.19 946.73 950.54 954.16 969.57 985.99 997.81 1025.92 1030.99 1040.11 1042.56 1045.48 1047.14 1050.11 1075.57 1084.00 1086.32 1103.39 1118.05 1119.77 1136.76 1148.83 1156.12 1158.80 1168.47 1171.26 1194.92 1212.63 1228.86 1250.35 1255.98 1265.44 1278.68 1288.00 1315.71 1328.82 1341.12 1347.48 1364.45 1367.93 1391.87 1394.75 1399.66 1402.43 1404.37 1410.08 1413.31 1427.69 1452.47 1459.80 1462.25 1464.98 1467.58 1469.04 1471.98 1475.31 1480.14 1481.51 1483.55 1488.38 1491.00 1493.70 1495.21 1505.89 1508.00 1524.58 1532.37 1564.22 1629.83 1633.27 1648.90 1659.41 2093.03 2555.09 2986.93 2990.81 2991.98 3000.24 3001.42 3020.18 3026.94 3054.55 3071.27 3072.08 3074.76 3077.88 3081.14 3096.53 3104.36 3109.63 3113.76 3116.04 3120.53 3123.52 3131.36
frequency: 20.44 28.91 31.93 41.13 43.05 46.84 68.81 72.12 85.05 107.26 119.89 122.81 138.21 142.19 146.77 152.07 153.34 155.12 159.82 162.50 166.76 169.85 179.15 184.00 187.37 190.54 202.22 214.55 222.23 255.79 264.42 280.65 281.36 285.05 290.53 292.33 296.68 299.19 304.68 308.09 315.47 317.75 322.08 342.40 351.83 360.68 383.70 385.89 406.52 413.98 429.42 449.93 452.66 475.80 486.49 496.71 507.52 519.23 528.23 536.07 543.47 551.72 579.11 585.12 588.40 608.58 613.13 628.11 638.60 649.08 651.62 655.01 661.48 686.68 701.22 732.98 762.03 771.95 774.83 795.08 797.17 799.57 800.58 832.54 872.81 882.61 905.80 910.19 946.73 950.54 954.16 969.57 985.99 997.81 1025.92 1030.99 1040.11 1042.56 1045.48 1047.14 1050.11 1075.57 1084.00 1086.32 1103.39 1118.05 1119.77 1136.76 1148.83 1156.12 1158.80 1168.47 1171.26 1194.92 1212.63 1228.86 1250.35 1255.98 1265.44 1278.68 1288.00 1315.71 1328.82 1341.12 1347.48 1364.45 1367.93 1391.87 1394.75 1399.66 1402.43 1404.37 1410.08 1413.31 1427.69 1452.47 1459.80 1462.25 1464.98 1467.58 1469.04 1471.98 1475.31 1480.14 1481.51 1483.55 1488.38 1491.00 1493.70 1495.21 1505.89 1508.00 1524.58 1532.37 1564.22 1629.83 1633.27 1648.90 1659.41 2093.03 2555.09 2986.93 2990.81 2991.98 3000.24 3001.42 3020.18 3026.94 3054.55 3071.27 3072.08 3074.76 3077.88 3081.14 3096.53 3104.36 3109.63 3113.76 3116.04 3120.53 3123.52 3131.36
formula: C29H23BF9Rh
InChI: InChI=1/C19H8BF9.C10H15.Rh/c21-11-7-6-4-1-2-5(3-4)8(6)20(9(7)12(22)16(26)15(11)25)10-13(23)17(27)19(29)18(28)14(10)24;1-6-7(2)9(4)10(5)8(6)3;/h4-5H,1-3H2;1-5H3;/rC29H23BF9Rh/c1-8-25(2)27(4)28(5)26(8,3)40(25,27,28)29(41-40)7-9-6-10(29)11-12-14(17(32)21(36)20(35)16(12)31)30(13(9)11)15-18(33)22(37)24(39)23(38)19(15)34/h9-10,29H,6-7H2,1-5H3
63 atoms
C  -2.06447 0.813381 1.808057
C  -1.975113 1.612919 0.594256
C  -1.748996 0.738274 -0.515407
C  -1.928914 -0.530604 1.568481
C  2.165753 0.329061 0.699328
C  2.921234 -0.314295 1.782165
C  1.956829 1.659652 1.061668
C  3.298332 0.667306 2.739091
C  2.565305 1.859662 2.38306
Rh 1.097473 0.384597 2.851282
C  -2.077292 2.968512 0.413225
C  -1.578075 1.304944 -1.753277
C  -1.692517 2.695985 -1.949407
C  -1.947329 3.520499 -0.872007
F  -2.269267 3.812033 1.442738
F  -2.036909 4.841953 -1.042966
F  -1.537888 3.218884 -3.169575
F  -1.264001 0.575445 -2.836419
B  -1.689644 -0.737679 0.074405
C  -1.486103 -2.077679 -0.690599
C  -2.103467 -2.366482 -1.910713
C  -0.684296 -3.093693 -0.164995
C  -1.913358 -3.563222 -2.586998
C  -0.453311 -4.293981 -0.818069
C  -1.076856 -4.529196 -2.038639
F  -0.061672 -2.911416 1.016121
F  -2.965486 -1.491837 -2.443941
F  -2.535219 -3.807323 -3.743103
F  -0.881029 -5.682768 -2.674954
F  0.353081 -5.222269 -0.29315
C  -2.029682 -1.214084 2.912247
C  -2.130066 1.041716 3.268146
C  -2.957338 -0.220422 3.667127
C  -0.740166 0.570058 3.922278
C  -0.698425 -0.946184 3.678868
C  1.842519 -0.330586 -0.600053
C  3.386997 -1.733563 1.743503
C  1.353604 2.749079 0.246379
C  2.686504 3.19231 3.048222
C  4.256361 0.506727 3.872313
H  0.178796 -1.313596 3.044078
H  2.734908 -0.364749 -1.241472
H  1.514275 -1.36428 -0.46061
H  1.058184 0.199656 -1.145147
H  2.140466 3.373327 -0.200704
H  0.742909 2.351526 -0.567007
H  0.726353 3.407231 0.85409
H  3.494036 3.777291 2.58729
H  1.762282 3.768562 2.952035
H  2.91119 3.08822 4.112521
H  5.280364 0.756942 3.559439
H  3.997816 1.158991 4.710626
H  4.266611 -0.520791 4.245729
H  4.275637 -1.832689 1.105201
H  3.650025 -2.0950 2.740885
H  2.616559 -2.395234 1.336944
H  0.548866 1.160036 4.138765
H  -2.467474 2.012651 3.631421
H  -2.984517 -0.388984 4.750782
H  -3.976255 -0.19764 3.26833
H  -0.871788 0.779334 4.991294
H  -0.623421 -1.524786 4.605697
H  -2.325634 -2.26524 2.907077
totalener: -2152.64779510831158 hartree
nucrepener: 5359.93863342952318 hartree
electener: -7512.58642853783476 hartree
twoeener: 6162.93809924973993 hartree
kineticenergy: 2074.75609369486074 hartree
exchangeener: -265.002201166988 hartree
correlationener: -10.170871362423 hartree
xcener: -275.173072529411 hartree
dispersion: -0.038861078 hartree
dispersion: -0.038894191 hartree
dispersion: -0.038907282 hartree
energy: -667.6807 -667.5421 -667.4618 -667.4538 -667.4131 -667.3266 -667.2579 -667.2440 -667.0879 -276.4949 -276.3101 -276.2745 -276.2660 -276.2321 -276.1526 -276.0695 -276.0073 -275.9972 -274.3478 -274.0490 -273.9581 -273.8775 -273.8349 -273.7835 -273.7522 -273.6853 -273.6803 -273.5617 -273.5317 -273.4936 -273.4812 -273.3278 -273.1137 -273.0903 -273.0643 -273.0512 -273.0505 -272.5983 -180.4247 -86.1832 -53.1016 -52.6407 -51.7440 -33.5884 -33.3182 -33.3104 -33.1672 -33.0320 -32.9464 -32.8403 -32.7866 -32.6353 -23.8690 -23.6796 -23.4505 -23.2552 -21.2608 -20.6238 -20.4662 -20.4355 -20.4238 -20.1389 -19.6972 -19.1237 -18.8385 -18.8098 -18.6183 -18.5057 -17.5623 -17.2307 -17.0658 -16.8424 -16.3434 -16.0620 -15.7217 -15.5135 -15.4455 -15.1551 -15.0493 -14.9285 -14.6245 -14.3251 -14.1488 -14.0089 -13.7997 -13.6999 -13.4532 -13.4056 -13.3502 -13.3252 -13.1597 -13.1136 -13.0697 -12.6252 -12.3902 -12.2636 -12.2341 -12.0916 -11.9110 -11.8656 -11.8207 -11.7142 -11.6209 -11.5374 -11.4955 -11.0830 -11.0227 -10.9998 -10.9813 -10.9264 -10.8441 -10.7981 -10.7522 -10.5876 -10.3726 -10.3396 -10.2677 -10.2093 -10.1054 -10.0755 -10.0540 -9.9878 -9.9122 -9.7786 -9.6354 -9.5975 -9.5746 -9.4762 -9.3299 -9.1696 -9.0684 -9.0561 -8.9462 -8.6568 -8.5638 -8.5339 -8.4972 -8.4590 -8.0419 -7.5388 -6.8914 -6.6091 -6.5353 -6.5280 -6.4063 -6.0564 -5.6215 -5.2584 -4.9234 -3.8716 -3.5657 -2.1618 -1.5795 -1.1871 -1.1190 -0.9053 -0.3609 -0.1834 0.0976 0.3771 0.5797 electronvolt
chargesum: 0.0000000
charge: 0.010445 0.141069 -0.138972 -0.190371 0.155045 0.291872 0.096437 -0.127283 0.427319 -0.253058 0.090747 0.254650 0.087441 0.152896 -0.197869 -0.176735 -0.174026 -0.195884 0.169190 -0.047459 0.271939 0.177240 0.097833 0.083424 0.180092 -0.198826 -0.193060 -0.175114 -0.174178 -0.178259 0.236882 0.008575 -0.587716 -0.140708 -0.417027 -0.696047 -0.548733 -0.699508 -0.498692 -0.612788 0.136626 0.164126 0.160338 0.169760 0.162357 0.159943 0.166903 0.165218 0.158991 0.154259 0.160717 0.151328 0.149467 0.166849 0.153237 0.163518 0.089084 0.178269 0.167113 0.175683 0.175614 0.188436 0.171382
charge: 0.006754 -0.027668 -0.114815 -0.143505 -0.063532 -0.066988 -0.052959 -0.082935 -0.056356 -0.530863 0.230042 0.232950 0.222848 0.230263 -0.256252 -0.237563 -0.239639 -0.248572 0.109567 -0.121660 0.253614 0.239052 0.226160 0.221338 0.244983 -0.252726 -0.238435 -0.237507 -0.230276 -0.241567 -0.161476 -0.156796 -0.234494 -0.198420 -0.201524 -0.363798 -0.371780 -0.363107 -0.369482 -0.367895 0.230513 0.164598 0.171202 0.174403 0.165914 0.174338 0.171739 0.166603 0.169331 0.167297 0.160516 0.165436 0.165543 0.167211 0.167406 0.170328 0.236575 0.175587 0.163344 0.170238 0.173412 0.172319 0.171167
qa: 0.0104 0.1411 -0.1390 -0.1904 0.1550 0.2919 0.0964 -0.1273 0.4273 -0.2531 0.0907 0.2547 0.0874 0.1529 -0.1979 -0.1767 -0.1740 -0.1959 0.1692 -0.0475 0.2719 0.1772 0.0978 0.0834 0.1801 -0.1988 -0.1931 -0.1751 -0.1742 -0.1783 0.2369 0.0086 -0.5877 -0.1407 -0.4170 -0.6960 -0.5487 -0.6995 -0.4987 -0.6128 0.1366 0.1641 0.1603 0.1698 0.1624 0.1599 0.1669 0.1652 0.1590 0.1543 0.1607 0.1513 0.1495 0.1668 0.1532 0.1635 0.0891 0.1783 0.1671 0.1757 0.1756 0.1884 0.1714
va: 3.5029 3.3299 3.6084 3.7295 3.2322 3.2788 3.5634 3.8791 3.0737 4.0127 3.5221 3.4342 3.6404 3.6541 1.0117 1.0341 1.0365 1.0030 3.6651 3.4097 3.6799 3.6793 3.6609 3.7027 3.6323 1.0082 1.0284 1.0345 1.0455 1.0327 3.1636 3.2861 3.7693 3.8779 3.9830 3.6539 3.6925 3.6631 3.7062 3.8146 0.9744 0.9562 0.9560 0.9592 0.9566 0.9688 0.9526 0.9569 0.9609 0.9643 0.9558 0.9638 0.9650 0.9559 0.9649 0.9612 1.0204 0.9576 0.9587 0.9533 0.9436 0.9459 0.9619
dispersion: -0.038902228 hartree
energy: -2152.654856505483 hartree
dipole: -45.823642347 46.633360012 0.809717665 -13.116486476 13.111241847 -0.005244629 -88.552369717 90.386315683 1.833945965
dipolemethod: SCF
magnitude: 2.004751358 au
magnitude: 5.095672992 debye
temp: 298.15 k
press: 1.00 atm
zeropoint: 0.44786917 hartree
thermalvibcorrection: 0.03493416 hartree
thermalrotcorrection: 0.00141627 hartree
thermaltrasncorrection: 0.00141627 hartree
thermaltotal: -2152.16922063 hartree
thermalcorr: 0.03776670 hartree
nonthermalcorr: 0.44786917 hartree
totalcorr: 0.48563587 hartree
thermalcorrenthalpy: 0.00094421 hartree
totalenthalpy: -2152.16827643 hartree
vibrat: 0.06183038 hartree
rotat: 0.01796480 hartree
transl: 0.02153568 hartree
total: 0.10133085 hartree
totalentropycorr: -0.10133085 hartree
gibbsenthalpy: -2152.26960728 hartree
gibbsminuselec: 0.38524923 hartree
