program: Orca
programVersion: 6.0.1
elementType: C C C C C C C C C Rh C C C C F F F F B C C C C C C F F F F F C C C C C C C C C C H H H H H H H H H H H H H H H H H H H H H H H
elementType: Rh
charge: 0
multiplicity: 1
keywords: OPTTS FREQ r2scan-3c
frequency: 0.00 0.00 0.00 0.00 0.00 0.00 -794.67 23.32 28.36 32.00 39.07 44.11 56.14 66.32 78.95 95.47 114.44 119.85 122.38 135.82 139.02 146.93 148.92 150.23 154.95 160.54 164.70 165.80 171.67 172.16 182.43 188.28 197.35 211.24 223.36 243.51 257.72 261.03 275.94 280.41 281.54 289.46 292.43 294.69 302.36 303.10 309.44 313.86 322.25 329.77 340.03 352.81 361.11 380.03 384.82 402.94 414.51 430.87 449.51 458.51 478.04 482.60 495.46 508.08 518.33 537.32 543.41 545.49 553.33 581.71 584.88 590.81 604.30 622.81 625.86 643.90 649.12 649.44 658.12 674.11 687.02 706.01 715.83 759.84 768.28 793.10 799.37 801.37 809.56 812.39 839.82 858.71 892.92 909.37 912.53 946.58 950.68 958.53 972.81 983.80 996.59 1007.93 1026.51 1036.28 1040.52 1047.19 1048.80 1053.85 1065.56 1084.38 1090.37 1101.61 1113.81 1118.45 1132.50 1145.38 1153.47 1160.53 1170.35 1181.74 1195.99 1207.61 1232.82 1239.35 1255.96 1267.42 1275.44 1284.24 1306.05 1331.64 1337.36 1340.97 1355.95 1372.08 1377.20 1389.31 1394.74 1403.13 1404.28 1405.40 1413.15 1419.34 1437.76 1450.78 1456.22 1461.66 1465.64 1467.11 1471.13 1474.15 1475.54 1478.05 1481.84 1485.48 1488.83 1490.92 1496.58 1506.88 1520.80 1524.70 1528.96 1542.00 1630.05 1632.69 1643.77 1656.02 2106.48 2487.64 2689.70 2993.87 2998.00 3002.29 3003.28 3018.17 3034.54 3046.91 3050.47 3071.83 3074.52 3076.09 3087.88 3093.81 3110.71 3114.28 3114.76 3116.72 3124.27 3124.40 3125.93
frequency: 23.32 28.36 32.00 39.07 44.11 56.14 66.32 78.95 95.47 114.44 119.85 122.38 135.82 139.02 146.93 148.92 150.23 154.95 160.54 164.70 165.80 171.67 172.16 182.43 188.28 197.35 211.24 223.36 243.51 257.72 261.03 275.94 280.41 281.54 289.46 292.43 294.69 302.36 303.10 309.44 313.86 322.25 329.77 340.03 352.81 361.11 380.03 384.82 402.94 414.51 430.87 449.51 458.51 478.04 482.60 495.46 508.08 518.33 537.32 543.41 545.49 553.33 581.71 584.88 590.81 604.30 622.81 625.86 643.90 649.12 649.44 658.12 674.11 687.02 706.01 715.83 759.84 768.28 793.10 799.37 801.37 809.56 812.39 839.82 858.71 892.92 909.37 912.53 946.58 950.68 958.53 972.81 983.80 996.59 1007.93 1026.51 1036.28 1040.52 1047.19 1048.80 1053.85 1065.56 1084.38 1090.37 1101.61 1113.81 1118.45 1132.50 1145.38 1153.47 1160.53 1170.35 1181.74 1195.99 1207.61 1232.82 1239.35 1255.96 1267.42 1275.44 1284.24 1306.05 1331.64 1337.36 1340.97 1355.95 1372.08 1377.20 1389.31 1394.74 1403.13 1404.28 1405.40 1413.15 1419.34 1437.76 1450.78 1456.22 1461.66 1465.64 1467.11 1471.13 1474.15 1475.54 1478.05 1481.84 1485.48 1488.83 1490.92 1496.58 1506.88 1520.80 1524.70 1528.96 1542.00 1630.05 1632.69 1643.77 1656.02 2106.48 2487.64 2689.70 2993.87 2998.00 3002.29 3003.28 3018.17 3034.54 3046.91 3050.47 3071.83 3074.52 3076.09 3087.88 3093.81 3110.71 3114.28 3114.76 3116.72 3124.27 3124.40 3125.93
formula: C29H23BF9Rh
InChI: InChI=1/C19H7BF9.C10H15.Rh.H/c21-11-7-6-4-1-2-5(3-4)8(6)20(9(7)12(22)16(26)15(11)25)10-13(23)17(27)19(29)18(28)14(10)24;1-6-7(2)9(4)10(5)8(6)3;;/h2,4-5H,1,3H2;1-5H3;;/rC29H23BF9Rh/c1-8-26(2)28(4)29(5)27(8,3)40(26,28,29)11-7-9-6-10(11)14-12(9)13-15(18(32)22(36)21(35)17(13)31)30(14)16-19(33)23(37)25(39)24(38)20(16)34/h9-11,40H,6-7H2,1-5H3
63 atoms
C  -1.484321 -0.734912 2.371776
C  -2.034981 0.126942 1.337224
C  -1.783754 -0.474565 0.065157
C  -0.793925 -1.807804 1.861761
C  2.070805 0.50102 0.802658
C  3.14107 -0.048292 1.624534
C  1.64337 1.68386 1.436292
C  3.510684 0.940586 2.624315
C  2.530992 1.961637 2.559242
Rh 1.56528 -0.016528 3.066141
C  -2.652718 1.350991 1.430962
C  -2.125022 0.237127 -1.057685
C  -2.762843 1.487603 -0.970731
C  -3.030315 2.038544 0.270194
F  -2.87096 1.941105 2.623445
F  -3.621879 3.234404 0.361006
F  -3.10267 2.153024 -2.080507
F  -1.848177 -0.214634 -2.293443
B  -0.996392 -1.830183 0.342181
C  -0.745397 -3.021172 -0.631072
C  -1.648624 -3.399836 -1.629238
C  0.397171 -3.818983 -0.522574
C  -1.424756 -4.471476 -2.482497
C  0.663098 -4.887697 -1.362621
C  -0.259075 -5.21685 -2.350472
F  1.318766 -3.534355 0.418027
F  -2.812553 -2.749696 -1.761926
F  -2.320431 -4.806688 -3.415853
F  -0.026482 -6.247015 -3.163975
F  1.787138 -5.602635 -1.238776
C  -0.357084 -2.602706 3.062497
C  -1.634873 -0.889356 3.867595
C  -1.628027 -2.44469 3.956323
C  -0.248856 -0.596142 4.496527
C  0.62312 -1.728488 3.935906
C  1.488519 -0.148428 -0.381405
C  3.943391 -1.255114 1.262948
C  0.546395 2.59182 0.991062
C  2.483208 3.2012 3.38988
C  4.72794 0.91495 3.487085
H  2.047445 -1.335732 3.813225
H  0.717028 -0.902132 -0.079162
H  0.974541 0.557244 -1.038434
H  2.235358 -0.699659 -0.961055
H  0.960668 3.527036 0.591208
H  -0.063571 2.125794 0.214718
H  -0.119905 2.862324 1.816744
H  3.035486 4.01736 2.90402
H  1.455308 3.545967 3.535176
H  2.927683 3.038231 4.375157
H  5.576236 1.394252 2.97854
H  4.561476 1.443814 4.429287
H  5.023022 -0.109325 3.728084
H  4.697165 -0.995065 0.507219
H  4.467722 -1.661622 2.131298
H  3.310109 -2.043498 0.849333
H  0.09099 0.466856 4.220473
H  -2.465416 -0.355172 4.332619
H  -1.500098 -2.808124 4.984428
H  -2.513194 -2.905324 3.506073
H  -0.267018 -0.570293 5.592158
H  1.008134 -2.365814 4.739982
H  0.004087 -3.617205 2.889761
totalener: -2152.65032752637035 hartree
nucrepener: 5344.38707121752668 hartree
electener: -7497.03739874389703 hartree
twoeener: 6147.63940536543214 hartree
kineticenergy: 2074.73975363105228 hartree
exchangeener: -264.998976718568 hartree
correlationener: -10.176792727197 hartree
xcener: -275.175769445765 hartree
dispersion: -0.039157456 hartree
dispersion: -0.039175260 hartree
dispersion: -0.039180369 hartree
energy: -667.5148 -667.3780 -667.2950 -667.2872 -667.2638 -667.1902 -667.1777 -667.0621 -666.9125 -276.2978 -276.1012 -276.0882 -276.0656 -276.0507 -276.0109 -275.9203 -275.8571 -275.8018 -274.3425 -274.2884 -274.0073 -273.9537 -273.9009 -273.8686 -273.8156 -273.7544 -273.7365 -273.7268 -273.6303 -273.6220 -273.5126 -273.2846 -273.2352 -273.2195 -273.2182 -273.1739 -273.1474 -272.6080 -180.1569 -86.3829 -53.2995 -52.8499 -51.9400 -33.4132 -33.1693 -33.1397 -32.9876 -32.8859 -32.7622 -32.6736 -32.6473 -32.4636 -23.8847 -23.6632 -23.4919 -23.1767 -21.2015 -20.6743 -20.6127 -20.4394 -20.2481 -20.0133 -19.7693 -19.0946 -19.0023 -18.9762 -18.7652 -18.5104 -17.4030 -17.0476 -16.9313 -16.7652 -16.4647 -16.2523 -15.6422 -15.4399 -15.3442 -14.9783 -14.8974 -14.8204 -14.5185 -14.2437 -13.9713 -13.8631 -13.6810 -13.6535 -13.5598 -13.5048 -13.2730 -13.2278 -13.1808 -13.0272 -12.9295 -12.4593 -12.3839 -12.2192 -12.1261 -12.0786 -12.0045 -11.8081 -11.6979 -11.6401 -11.5086 -11.4473 -11.3583 -11.1781 -11.1329 -10.9741 -10.9511 -10.9270 -10.8526 -10.7949 -10.7367 -10.5964 -10.4653 -10.4011 -10.2688 -10.2378 -10.2115 -10.1824 -10.1508 -10.0002 -9.9067 -9.7462 -9.7329 -9.5634 -9.5310 -9.4296 -9.3375 -9.1720 -9.0287 -9.0052 -8.9080 -8.7374 -8.7082 -8.6992 -8.6240 -8.3717 -7.9637 -7.4042 -6.9390 -6.7192 -6.5742 -6.3761 -6.3502 -6.2156 -5.7103 -5.4499 -4.9182 -4.0590 -3.3287 -2.3045 -1.4249 -1.0181 -0.9922 -0.7431 -0.3262 -0.1619 -0.1014 0.0647 0.4514 electronvolt
chargesum: 0.0000000
charge: -0.159601 0.080202 -0.046643 0.159575 0.114011 0.396723 0.221181 -0.027602 0.172021 -0.275748 0.092873 0.239984 0.100846 0.144023 -0.204456 -0.180728 -0.177280 -0.200505 -0.056887 -0.070072 0.256421 0.255055 0.078776 0.063255 0.180165 -0.198562 -0.195656 -0.177597 -0.176875 -0.180800 -0.035974 0.165420 -0.558050 -0.341757 -0.211106 -0.722390 -0.511630 -0.617814 -0.560180 -0.588545 0.083299 0.183360 0.176192 0.167038 0.162969 0.163241 0.173991 0.170359 0.152167 0.156127 0.164042 0.149802 0.153639 0.167569 0.150731 0.181049 0.133433 0.180965 0.163504 0.177665 0.186916 0.178773 0.179096
charge: -0.006765 -0.032995 -0.113233 -0.125210 -0.064099 -0.048321 -0.049264 -0.072694 -0.071371 -0.522599 0.222282 0.233051 0.222157 0.225767 -0.263378 -0.242023 -0.243224 -0.250903 0.024774 -0.123925 0.250744 0.241852 0.224691 0.221114 0.241195 -0.255378 -0.240291 -0.239995 -0.233335 -0.243922 -0.153416 -0.161270 -0.231966 -0.195956 -0.191354 -0.330708 -0.370841 -0.364835 -0.369311 -0.366837 0.236399 0.204560 0.173407 0.170773 0.168819 0.176115 0.174031 0.167381 0.168088 0.167705 0.163209 0.166438 0.166931 0.168405 0.168192 0.177423 0.227148 0.174967 0.163067 0.171813 0.172306 0.170724 0.173891
qa: -0.1596 0.0802 -0.0466 0.1596 0.1140 0.3967 0.2212 -0.0276 0.1720 -0.2757 0.0929 0.2400 0.1008 0.1440 -0.2045 -0.1807 -0.1773 -0.2005 -0.0569 -0.0701 0.2564 0.2551 0.0788 0.0633 0.1802 -0.1986 -0.1957 -0.1776 -0.1769 -0.1808 -0.0360 0.1654 -0.5581 -0.3418 -0.2111 -0.7224 -0.5116 -0.6178 -0.5602 -0.5885 0.0833 0.1834 0.1762 0.1670 0.1630 0.1632 0.1740 0.1704 0.1522 0.1561 0.1640 0.1498 0.1536 0.1676 0.1507 0.1810 0.1334 0.1810 0.1635 0.1777 0.1869 0.1788 0.1791
va: 3.4676 3.3300 3.5431 3.2147 3.7670 3.0903 3.2241 3.7318 3.5170 4.0271 3.5232 3.5201 3.6286 3.6613 1.0005 1.0294 1.0341 1.0016 3.9139 3.4746 3.6539 3.5659 3.6820 3.6815 3.6287 1.0127 1.0228 1.0325 1.0431 1.0298 3.4938 3.2058 3.7670 3.8615 3.9512 3.6928 3.7284 3.6423 3.7363 3.8149 1.0215 0.9611 0.9528 0.9544 0.9566 0.9684 0.9518 0.9554 0.9631 0.9634 0.9559 0.9650 0.9634 0.9555 0.9650 0.9564 0.9779 0.9585 0.9608 0.9523 0.9502 0.9436 0.9565
dispersion: -0.039182110 hartree
energy: -2152.657213597218 hartree
dipole: -57.133142458 58.637908961 1.504766503 -25.735380518 26.224538883 0.489158365 -86.980153719 89.129136315 2.148982596
dipolemethod: SCF
magnitude: 2.668655903 au
magnitude: 6.783184238 debye
temp: 298.15 k
press: 1.00 atm
zeropoint: 0.44700251 hartree
thermalvibcorrection: 0.03480652 hartree
thermalrotcorrection: 0.00141627 hartree
thermaltrasncorrection: 0.00141627 hartree
thermaltotal: -2152.17257202 hartree
thermalcorr: 0.03763907 hartree
nonthermalcorr: 0.44700251 hartree
totalcorr: 0.48464158 hartree
thermalcorrenthalpy: 0.00094421 hartree
totalenthalpy: -2152.17162781 hartree
vibrat: 0.06151213 hartree
rotat: 0.01799858 hartree
transl: 0.02153568 hartree
total: 0.10104639 hartree
totalentropycorr: -0.10104639 hartree
gibbsenthalpy: -2152.27267420 hartree
gibbsminuselec: 0.38453940 hartree
