program: Orca
programVersion: 6.0.1
elementType: C C C C Rh C C C C C C H H H C H H H C H H H C H H H B C C C C C C F F F F F C H H H C C C H H H H C C H H C C C C F F F F H H
elementType: Rh
charge: 0
multiplicity: 1
keywords: r2scan0 d4 ma-def2-qzvp SP TIGHTSCF AIM NBO SMD(toluene)
formula: C29H23BF9Rh
InChI: InChI=1/C19H8BF9.C10H15.Rh/c21-11-7-6-4-1-2-5(3-4)8(6)20(9(7)12(22)16(26)15(11)25)10-13(23)17(27)19(29)18(28)14(10)24;1-6-7(2)9(4)10(5)8(6)3;/h4-5H,1-3H2;1-5H3;/rC29H23BF9Rh/c1-21-22(2)24(4)25(5)23(21,3)40(21,22,24,25)26-9-6-7-10(8-9)28(26,40)30(40,11-12(31)14(33)16(35)15(34)13(11)32)29(40)20(39)18(37)17(36)19(38)27(26,29)40/h9-10H,6-8H2,1-5H3
63 atoms
C  2.110377 0.342616 0.462528
C  0.791352 -0.225434 0.415723
C  0.912077 -1.685723 0.408514
C  3.107597 -0.68686 0.395422
Rh 1.878896 -0.865335 2.252852
C  3.018172 -0.807246 4.129676
C  2.31625 -2.066819 4.067489
C  2.038313 0.25789 4.176637
C  0.917494 -1.774306 4.009317
C  0.744823 -0.337987 4.086359
C  2.316073 1.711762 4.372161
H  2.210562 1.982088 5.431081
H  3.330432 1.977309 4.066907
H  1.622289 2.334025 3.800109
C  -0.566555 0.37137 4.10388
H  -1.296124 -0.124742 3.455668
H  -0.987653 0.388464 5.117545
H  -0.468085 1.405611 3.763704
C  -0.186545 -2.774874 3.965229
H  0.144581 -3.717712 3.523528
H  -0.551606 -2.984173 4.979237
H  -1.036713 -2.410294 3.380206
C  2.917846 -3.430098 4.160209
H  3.993033 -3.405968 3.976774
H  2.75706 -3.847273 5.162991
H  2.470226 -4.119285 3.437634
B  2.433261 -2.059119 0.363626
C  3.09329 -3.478272 0.248508
C  4.272532 -3.804947 0.915298
C  2.58351 -4.478355 -0.580708
C  4.881113 -5.048286 0.831605
C  3.165729 -5.733489 -0.702345
C  4.319844 -6.022273 0.014997
F  4.876927 -2.883236 1.694434
F  5.999778 -5.317274 1.517823
F  4.895237 -7.222522 -0.091783
F  2.644623 -6.65795 -1.516485
F  1.506431 -4.231648 -1.343247
C  4.49281 -0.656013 4.297935
H  5.03676 -1.382706 3.690908
H  4.835063 0.342278 4.015836
H  4.770868 -0.81631 5.348221
C  4.408725 0.054921 0.201616
C  2.78861 1.669531 0.265858
C  4.143347 1.380661 0.954097
H  4.044228 1.239781 2.032768
H  4.894605 2.149825 0.74089
H  5.324477 -0.48285 0.452552
H  2.243943 2.561836 0.579503
C  4.339759 0.562345 -1.273684
C  3.230671 1.659428 -1.231237
H  4.101749 -0.250158 -1.965739
H  2.391881 1.440064 -1.898392
C  -0.293472 -2.414371 0.555874
C  -0.477851 0.39309 0.462449
C  -1.605766 -0.373919 0.524035
C  -1.511638 -1.791762 0.57878
F  -0.256172 -3.750488 0.686564
F  -2.651827 -2.489831 0.68397
F  -2.822271 0.181263 0.578469
F  -0.567469 1.735616 0.476989
H  5.304646 0.988689 -1.568266
H  3.630941 2.641049 -1.505534
elementType: C Rh H B F
totalener: -2152.66155063699989 hartree
nucrepener: 5551.92780311784827 hartree
electener: -7704.56961218110791 hartree
twoeener: 6354.97193123571469 hartree
cpcmener: -0.01159754115464 hartree
kineticenergy: 2073.52397399454912 hartree
exchangeener: -198.794639865023 hartree
energy: -679.8297 -679.7268 -679.7215 -679.6635 -679.6005 -679.5863 -679.4759 -679.3911 -679.3634 -284.5376 -284.3896 -284.3517 -284.3244 -284.2976 -284.2775 -284.2289 -284.2164 -284.1700 -282.6270 -282.4105 -282.2923 -282.2811 -282.2570 -282.2078 -281.9992 -281.9014 -281.7561 -281.6701 -281.4690 -281.3829 -281.3534 -281.3168 -281.2969 -281.2532 -281.1980 -281.1579 -281.1465 -281.1294 -186.2603 -91.3536 -57.2091 -56.4481 -56.3230 -36.4448 -36.3171 -36.1770 -36.0280 -36.0016 -35.8188 -35.7290 -35.6927 -35.6209 -26.3233 -26.0225 -25.7505 -25.3292 -23.4628 -22.9093 -22.8844 -22.5475 -22.3479 -22.3418 -21.2035 -21.0672 -21.0048 -20.9435 -20.8179 -20.2619 -19.3774 -19.0347 -18.9785 -18.7428 -18.3816 -18.2742 -17.2389 -17.1589 -17.1037 -16.8467 -16.7548 -16.5706 -16.2943 -15.9251 -15.6478 -15.6134 -15.5231 -15.2722 -15.2657 -15.2003 -15.1294 -15.0307 -14.8917 -14.7047 -14.4520 -14.3115 -14.2512 -14.1239 -13.8991 -13.7573 -13.6748 -13.6644 -13.5815 -13.4672 -13.3936 -13.3534 -13.0186 -12.9516 -12.8888 -12.7743 -12.7476 -12.5796 -12.5461 -12.4068 -12.3797 -12.1976 -11.9911 -11.9055 -11.7704 -11.6756 -11.5748 -11.5434 -11.5291 -11.3873 -11.2630 -11.1674 -11.1514 -11.0779 -10.9859 -10.5607 -10.3970 -10.2657 -10.2325 -10.1621 -10.0630 -9.9983 -9.9741 -9.7145 -9.6130 -9.4224 -8.9670 -8.7738 -8.5978 -8.4463 -7.9987 -7.7738 -7.6070 -7.5440 -7.3464 -7.0702 -6.5963 -5.6344 -1.7158 -1.1362 -0.4845 -0.2561 -0.0877 -0.0271 0.1766 0.2255 0.2715 0.4538 0.6282 electronvolt
chargesum: -0.0000000
charge: -0.385607 0.398057 0.031318 -0.061146 1.586249 0.001753 -0.304750 -0.119173 0.035359 -0.098569 -0.148454 0.050236 0.027050 0.042158 -0.138133 0.034813 0.045237 0.044771 -0.191728 0.045389 0.045344 0.041517 -0.141447 0.037412 0.042462 0.046317 0.046912 -0.045680 0.192855 0.256899 -0.004099 0.086599 0.447542 -0.244977 -0.271061 -0.246266 -0.267123 -0.263815 -0.131521 0.049356 0.026241 0.053184 0.024250 -0.000907 -0.005320 -0.023492 0.006776 0.060507 0.069449 -0.051615 -0.037248 0.018564 0.015608 0.123825 -0.128822 0.305009 0.056514 -0.267024 -0.274995 -0.274436 -0.307135 0.017471 0.021540
charge: -0.123851 -0.115591 0.010272 0.004356 0.683970 -0.160911 -0.157741 -0.161839 -0.160392 -0.159322 0.227133 -0.015457 -0.020486 -0.013824 0.236358 -0.008516 -0.013970 -0.010725 0.241779 -0.006647 -0.012189 -0.007350 0.237959 -0.011319 -0.013988 -0.008010 -0.671007 0.041116 -0.364473 -0.356237 -0.380626 -0.375513 -0.375243 0.307620 0.353990 0.365965 0.359068 0.350511 0.232614 -0.009420 -0.018769 -0.013066 -0.026014 -0.025269 0.119685 -0.010505 -0.005192 -0.002902 -0.002861 0.131875 0.132678 -0.014637 -0.014382 -0.380464 -0.376662 -0.387257 -0.388093 0.341100 0.348951 0.356515 0.337326 -0.020432 -0.019691
qa: -0.3856 0.3981 0.0313 -0.0611 1.5862 0.0018 -0.3048 -0.1192 0.0354 -0.0986 -0.1485 0.0502 0.0270 0.0422 -0.1381 0.0348 0.0452 0.0448 -0.1917 0.0454 0.0453 0.0415 -0.1414 0.0374 0.0425 0.0463 0.0469 -0.0457 0.1929 0.2569 -0.0041 0.0866 0.4475 -0.2450 -0.2711 -0.2463 -0.2671 -0.2638 -0.1315 0.0494 0.0262 0.0532 0.0242 -0.0009 -0.0053 -0.0235 0.0068 0.0605 0.0694 -0.0516 -0.0372 0.0186 0.0156 0.1238 -0.1288 0.3050 0.0565 -0.2670 -0.2750 -0.2744 -0.3071 0.0175 0.0215
va: 3.2058 2.6667 2.2601 2.4519 4.1033 3.2350 3.5043 3.5315 3.2040 3.2629 3.7921 1.0004 1.0020 0.9937 3.8129 1.0048 0.9969 0.9900 3.8696 0.9919 0.9968 0.9996 3.7765 0.9938 0.9971 0.9888 1.9838 2.7590 3.4766 3.2027 3.7411 3.5236 3.3013 0.7819 0.9113 0.9017 0.9145 0.8591 3.8208 0.9914 0.9988 0.9996 3.5783 3.4522 3.6339 1.0922 1.0075 0.9820 0.9811 3.7916 3.7920 1.0027 1.0101 3.3898 3.5258 3.3126 3.5538 0.8131 0.8734 0.8793 0.8740 1.0020 1.0001
dispersion: -0.043457601 hartree
energy: -2152.705008238002 hartree
dipole: 21.436120732 -20.556931390 0.879189342 -11.155658124 13.344822338 2.189164214 -22.035962351 24.516422324 2.480459973
dipolemethod: SCF
magnitude: 3.423170392 au
magnitude: 8.701007656 debye
