program: Orca
programVersion: 6.0.1
elementType: H F
charge: 0
multiplicity: 1
keywords: r2scan0 d4 ma-def2-qzvp SP TIGHTSCF AIM NBO SMD(toluene)
formula: HF
InChI: InChI=1/FH/h1H
2 atoms
H  -0.828583 -0.001302 -0.606124
F  -0.483864 0.727652 -0.156373
totalener: -100.44471521293960 hartree
nucrepener: 5.15823701683406 hartree
electener: -105.59776431840658 hartree
oneelecener: -150.54395613923347 hartree
twoeener: 44.94619182082690 hartree
cpcmener: -0.00604162143768 hartree
kineticenergy: 100.12100981670783 hartree
exchangeener: -7.846012733399 hartree
energy: -678.4338 -34.5838 -15.7612 -12.1470 -12.1469 1.3606 2.6828 2.9069 2.9070 6.6055 9.5136 13.6706 14.0961 14.0964 16.7177 16.7186 electronvolt
chargesum: -0.0000000
charge: 0.351912 -0.351912
charge: -0.464253 0.464253
qa: 0.3519 -0.3519
va: 0.9438 0.9438
dispersion: -0.000018460 hartree
energy: -100.444733673145 hartree
dipole: -0.323205069 0.024271478 -0.298933591 -0.683459861 0.051387622 -0.632072239 -0.421681756 0.031680661 -0.390001095
dipolemethod: SCF
magnitude: 0.800610680 au
magnitude: 2.034990625 debye
