program: Orca
programVersion: 6.0.1
elementType: C C C C C C C C C Rh C C C C F F F F B C C C C C C F F F F F C C C C C C C C C C H H H H H H H H H H H H H H H H H H H H H H F
elementType: Rh
charge: 0
multiplicity: 1
keywords: OPT FREQ r2scan-3c
frequency: 0.00 0.00 0.00 0.00 0.00 0.00 21.58 27.03 29.78 31.93 42.21 60.25 88.26 90.17 106.13 109.90 113.95 121.74 132.72 145.11 146.39 152.93 157.16 160.75 165.48 168.29 169.39 172.74 178.88 181.65 188.18 198.72 205.72 209.88 215.01 234.18 235.23 250.13 278.15 280.71 285.08 287.63 293.48 302.21 302.57 306.37 316.73 318.21 326.56 333.61 349.62 371.20 379.74 386.04 390.10 403.44 414.61 420.50 431.31 449.35 453.19 482.99 491.28 496.97 510.00 516.93 542.73 552.41 555.76 569.60 584.01 591.67 593.18 615.87 625.71 629.82 635.91 646.28 652.46 664.98 675.89 685.37 704.93 726.24 745.03 764.89 787.80 794.75 799.55 805.36 808.96 825.30 838.46 865.48 879.94 897.96 911.14 937.50 951.64 955.45 962.04 964.31 975.66 983.68 1005.37 1015.53 1037.26 1039.11 1043.68 1048.16 1048.49 1053.97 1069.90 1087.73 1091.62 1094.63 1105.56 1113.49 1122.65 1133.90 1136.37 1159.10 1173.96 1177.08 1197.68 1216.70 1242.79 1256.91 1277.80 1287.95 1297.61 1310.07 1339.27 1344.96 1376.00 1382.76 1385.76 1386.87 1403.71 1406.71 1409.37 1416.40 1422.04 1422.75 1425.05 1438.80 1442.50 1445.94 1463.76 1466.01 1471.46 1473.53 1477.18 1479.05 1483.46 1489.33 1492.09 1495.79 1499.43 1503.80 1505.62 1508.54 1527.28 1618.24 1638.13 1650.06 1657.63 2109.00 3007.32 3007.76 3008.95 3009.98 3011.45 3020.56 3081.16 3084.54 3088.90 3090.90 3092.32 3097.06 3115.92 3120.08 3128.74 3131.52 3134.62 3142.40 3144.21 3194.09 3210.43
frequency: 21.58 27.03 29.78 31.93 42.21 60.25 88.26 90.17 106.13 109.90 113.95 121.74 132.72 145.11 146.39 152.93 157.16 160.75 165.48 168.29 169.39 172.74 178.88 181.65 188.18 198.72 205.72 209.88 215.01 234.18 235.23 250.13 278.15 280.71 285.08 287.63 293.48 302.21 302.57 306.37 316.73 318.21 326.56 333.61 349.62 371.20 379.74 386.04 390.10 403.44 414.61 420.50 431.31 449.35 453.19 482.99 491.28 496.97 510.00 516.93 542.73 552.41 555.76 569.60 584.01 591.67 593.18 615.87 625.71 629.82 635.91 646.28 652.46 664.98 675.89 685.37 704.93 726.24 745.03 764.89 787.80 794.75 799.55 805.36 808.96 825.30 838.46 865.48 879.94 897.96 911.14 937.50 951.64 955.45 962.04 964.31 975.66 983.68 1005.37 1015.53 1037.26 1039.11 1043.68 1048.16 1048.49 1053.97 1069.90 1087.73 1091.62 1094.63 1105.56 1113.49 1122.65 1133.90 1136.37 1159.10 1173.96 1177.08 1197.68 1216.70 1242.79 1256.91 1277.80 1287.95 1297.61 1310.07 1339.27 1344.96 1376.00 1382.76 1385.76 1386.87 1403.71 1406.71 1409.37 1416.40 1422.04 1422.75 1425.05 1438.80 1442.50 1445.94 1463.76 1466.01 1471.46 1473.53 1477.18 1479.05 1483.46 1489.33 1492.09 1495.79 1499.43 1503.80 1505.62 1508.54 1527.28 1618.24 1638.13 1650.06 1657.63 2109.00 3007.32 3007.76 3008.95 3009.98 3011.45 3020.56 3081.16 3084.54 3088.90 3090.90 3092.32 3097.06 3115.92 3120.08 3128.74 3131.52 3134.62 3142.40 3144.21 3194.09 3210.43
formula: C29H22BF10Rh
InChI: InChI=1/C19H6BF10.C10H15.Rh.H/c21-11-7-6-4-1-2-5(3-4)8(6)20(30,9(7)12(22)16(26)15(11)25)10-13(23)17(27)19(29)18(28)14(10)24;1-6-7(2)9(4)10(5)8(6)3;;/h1-2,4-5H,3H2;1-5H3;;/rC29H22BF10Rh/c1-23-24(2)26(4)27(5)25(23,3)41(23,24,26,27)21-7-6-8(22(21)41)29(41)28(7,41)9-10(13(32)17(36)16(35)12(9)31)30(29,40)11-14(33)18(37)20(39)19(38)15(11)34/h7-8,21-22,41H,6H2,1-5H3
63 atoms
C  -0.964369 -0.415804 1.105541
C  -0.962551 0.692417 0.158631
C  -0.413198 0.275208 -1.075951
C  -0.400002 -1.590789 0.552373
C  3.168665 -0.412659 1.742947
C  2.971463 -0.72319 3.14031
C  2.426757 0.778472 1.445842
C  2.123111 0.297554 3.69427
C  1.787206 1.225323 2.656025
Rh 1.01776 -0.874845 2.094286
C  -1.436687 1.982026 0.338054
C  -0.319655 1.209657 -2.081375
C  -0.781937 2.51572 -1.912959
C  -1.347351 2.901394 -0.700024
F  -1.984208 2.374158 1.510305
F  -1.800623 4.151639 -0.543695
F  -0.707605 3.406503 -2.907916
F  0.190493 0.88527 -3.282437
B  0.027894 -1.313367 -1.015676
C  -0.855411 -2.335276 -1.940347
C  -1.963139 -2.017163 -2.717758
C  -0.510849 -3.685821 -1.932883
C  -2.667799 -2.956162 -3.464492
C  -1.181764 -4.657199 -2.661806
C  -2.272517 -4.28552 -3.437275
F  0.520268 -4.108323 -1.170273
F  -2.4222 -0.750565 -2.782763
F  -3.725226 -2.595464 -4.204301
F  -2.940236 -5.20356 -4.143638
F  -0.804144 -5.942995 -2.619435
C  -1.004407 -2.732456 1.399559
C  -1.873064 -0.81675 2.265082
C  -2.411109 -2.164712 1.718581
C  -0.802696 -1.29743 3.255439
C  -0.280684 -2.497797 2.742371
C  4.082601 -1.108562 0.790418
C  3.643732 -1.813113 3.907308
C  2.427649 1.478484 0.132834
C  1.031402 2.500337 2.822266
C  1.737303 0.406397 5.131365
H  5.035374 -0.566471 0.733005
H  4.293791 -2.13146 1.109274
H  3.64591 -1.149389 -0.20985
H  3.331898 2.094574 0.039826
H  2.412396 0.761225 -0.692082
H  1.561344 2.134415 0.025135
H  1.712499 3.305092 3.128896
H  0.559952 2.810011 1.887598
H  0.248643 2.418136 3.580105
H  2.543836 0.883694 5.702539
H  0.836806 1.011015 5.262797
H  1.5612 -0.576871 5.577724
H  4.598518 -1.462354 4.32043
H  3.02711 -2.152097 4.744203
H  3.851197 -2.677114 3.272067
H  -2.580687 -0.074589 2.631777
H  -2.954116 -2.746754 2.473934
H  -3.026536 -2.035248 0.820545
H  -0.931353 -3.73707 0.984725
H  -0.697494 -0.930546 4.270017
H  1.461615 -2.172942 1.358048
H  0.23393 -3.266459 3.307033
F  1.413241 -1.469281 -1.292904
totalener: -2252.01564727254663 hartree
nucrepener: 5737.93208235242219 hartree
electener: -7989.94772962496882 hartree
twoeener: 6580.87957428470236 hartree
kineticenergy: 2173.53165785477040 hartree
exchangeener: -274.793439611359 hartree
correlationener: -10.480987785642 hartree
xcener: -285.274427397001 hartree
dispersion: -0.040403163 hartree
dispersion: -0.040412464 hartree
dispersion: -0.040384952 hartree
dispersion: -0.040401404 hartree
dispersion: -0.040409755 hartree
dispersion: -0.040404178 hartree
dispersion: -0.040409607 hartree
dispersion: -0.040407594 hartree
dispersion: -0.040406015 hartree
dispersion: -0.040403311 hartree
dispersion: -0.040402481 hartree
energy: -667.2033 -667.1757 -667.0740 -667.0059 -666.8703 -666.8259 -666.5549 -666.5466 -666.5320 -664.2464 -275.9140 -275.8273 -275.7879 -275.7128 -275.5304 -275.5146 -275.4514 -275.4400 -275.4294 -274.7526 -274.6970 -274.6033 -274.5445 -274.5320 -274.4562 -274.3981 -274.2965 -274.1167 -274.0073 -273.8674 -273.8635 -273.8346 -273.6752 -273.5535 -273.4382 -273.4123 -273.3439 -272.9033 -272.8633 -180.0979 -88.2450 -54.9596 -54.4457 -54.1340 -33.0772 -32.8768 -32.7834 -32.5903 -32.5863 -32.4286 -32.1509 -32.1031 -32.0806 -29.3650 -24.5472 -24.2748 -23.1567 -22.9232 -21.3324 -21.2406 -21.2172 -19.9453 -19.7888 -19.7141 -19.6565 -19.6255 -19.3678 -19.3541 -19.2927 -18.7366 -16.9919 -16.9765 -16.9198 -16.7329 -16.6139 -16.4682 -15.4386 -15.1388 -14.8318 -14.7331 -14.4327 -14.3485 -14.2859 -14.1941 -14.1686 -14.1521 -13.9145 -13.5574 -13.4053 -13.2914 -13.2142 -13.0878 -12.9977 -12.7694 -12.7312 -12.5752 -12.4069 -12.1509 -12.1081 -12.0080 -11.8870 -11.7561 -11.7065 -11.6194 -11.6120 -11.5719 -11.4459 -11.3003 -11.1957 -11.1165 -11.0685 -11.0076 -10.9536 -10.8344 -10.7764 -10.7143 -10.6287 -10.6060 -10.5509 -10.5010 -10.3993 -10.3910 -10.3075 -10.1679 -10.0991 -10.0333 -9.7935 -9.6563 -9.5979 -9.5080 -9.4130 -9.3564 -9.3345 -9.2241 -9.1673 -9.1262 -9.0572 -8.9151 -8.7944 -8.6969 -8.3304 -8.2533 -8.0953 -7.7548 -7.5344 -7.1229 -6.9680 -6.7901 -6.6244 -6.3280 -6.0969 -5.8586 -5.7980 -5.6480 -2.8111 -2.4586 -1.5776 -1.0405 -0.7731 -0.6854 -0.4623 -0.3319 -0.2399 -0.1845 -0.0559 electronvolt
chargesum: 0.0000000
charge: -0.187452 0.209540 -0.008925 -0.036718 0.192498 0.172871 0.271004 0.124187 0.179726 -0.687148 -0.003801 0.190665 0.114544 0.124097 -0.210154 -0.181598 -0.174446 -0.193740 0.383543 -0.012314 0.265501 0.196975 0.071779 0.062643 0.164462 -0.207575 -0.205005 -0.184088 -0.185670 -0.185143 0.258345 0.136919 -0.556491 -0.157563 -0.180297 -0.542973 -0.560793 -0.661533 -0.575534 -0.605378 0.165561 0.148905 0.207487 0.165716 0.213497 0.162507 0.169397 0.169215 0.154737 0.176358 0.164405 0.165363 0.171661 0.149073 0.166167 0.178486 0.161232 0.184894 0.186492 0.182974 0.186566 0.176279 -0.421929
charge: 0.000982 -0.034208 -0.069784 -0.069282 -0.033781 -0.068181 -0.035846 -0.042104 -0.057822 -0.439924 0.209234 0.226907 0.231959 0.220178 -0.269580 -0.246442 -0.241738 -0.248550 0.100813 -0.092438 0.236684 0.233333 0.219635 0.218605 0.231132 -0.258191 -0.255647 -0.248519 -0.242848 -0.250420 -0.144095 -0.141423 -0.227712 -0.095811 -0.107180 -0.364609 -0.363423 -0.355026 -0.361740 -0.369926 0.169401 0.169091 0.191317 0.172753 0.196152 0.177908 0.171063 0.178698 0.170004 0.175285 0.170062 0.169553 0.169771 0.167583 0.172453 0.180344 0.168360 0.177600 0.184052 0.187512 0.249512 0.186761 -0.348447
qa: -0.1875 0.2095 -0.0089 -0.0367 0.1925 0.1729 0.2710 0.1242 0.1797 -0.6871 -0.0038 0.1907 0.1145 0.1241 -0.2102 -0.1816 -0.1744 -0.1937 0.3835 -0.0123 0.2655 0.1970 0.0718 0.0626 0.1645 -0.2076 -0.2050 -0.1841 -0.1857 -0.1851 0.2583 0.1369 -0.5565 -0.1576 -0.1803 -0.5430 -0.5608 -0.6615 -0.5755 -0.6054 0.1656 0.1489 0.2075 0.1657 0.2135 0.1625 0.1694 0.1692 0.1547 0.1764 0.1644 0.1654 0.1717 0.1491 0.1662 0.1785 0.1612 0.1849 0.1865 0.1830 0.1866 0.1763 -0.4219
va: 3.5899 3.3226 3.4443 3.2092 3.7139 3.5656 3.5647 3.5700 3.3715 4.9458 3.4889 3.5292 3.5966 3.6717 0.9870 1.0291 1.0338 1.0049 3.7883 3.3941 3.5065 3.6149 3.6565 3.6878 3.6331 1.0009 1.0006 1.0229 1.0321 1.0242 3.3795 3.5199 3.7726 3.8165 3.8022 3.7158 3.7759 3.6227 3.7016 3.7245 0.9553 0.9655 0.9506 0.9565 0.9466 0.9641 0.9541 0.9637 0.9604 0.9540 0.9603 0.9575 0.9547 0.9646 0.9609 0.9608 0.9618 0.9527 0.9566 0.9646 0.9911 0.9647 0.8854
dispersion: -0.040402834 hartree
energy: -2252.026286629352 hartree
dipole: -30.971630611 32.826451408 1.854820797 14.738496019 -14.214263802 0.524232218 -59.964971762 64.723345747 4.758373985
dipolemethod: SCF
magnitude: 5.133936364 au
magnitude: 13.049429183 debye
temp: 298.15 k
press: 1.00 atm
zeropoint: 0.44201936 hartree
thermalvibcorrection: 0.03559478 hartree
thermalrotcorrection: 0.00141627 hartree
thermaltrasncorrection: 0.00141627 hartree
thermaltotal: -2251.54583995 hartree
thermalcorr: 0.03842732 hartree
nonthermalcorr: 0.44201936 hartree
totalcorr: 0.48044668 hartree
thermalcorrenthalpy: 0.00094421 hartree
totalenthalpy: -2251.54489574 hartree
vibrat: 0.06285580 hartree
rotat: 0.01794263 hartree
transl: 0.02157398 hartree
total: 0.10237241 hartree
totalentropycorr: -0.10237241 hartree
gibbsenthalpy: -2251.64726815 hartree
gibbsminuselec: 0.37901848 hartree
