program: Orca
programVersion: 6.0.1
elementType: C C C C C C C C C Rh C C C C F F F F B C C C C C C F F F F F C C C C C C C C C C H H H H H H H H H H H H H H H H H H H H H H F
elementType: Rh
charge: 0
multiplicity: 1
keywords: OPTTS FREQ r2scan-3c
frequency: 0.00 0.00 0.00 0.00 0.00 0.00 -669.31 23.48 25.85 27.94 30.79 40.96 54.59 82.15 95.28 100.32 104.95 113.41 122.61 126.18 131.37 139.48 147.11 148.90 152.34 153.63 158.64 161.18 162.16 167.05 184.03 189.23 206.43 208.56 218.69 232.55 237.35 248.22 259.57 278.73 279.49 282.62 286.26 288.26 305.80 308.31 311.37 316.34 320.04 328.17 339.67 351.10 371.72 386.47 388.41 398.65 404.80 419.45 428.25 431.82 453.16 458.02 490.24 496.28 504.04 519.62 539.94 544.81 555.31 567.69 584.83 591.31 604.43 622.54 625.82 631.25 640.63 649.84 652.31 668.00 677.13 681.17 708.20 714.57 752.23 765.07 788.22 792.88 800.25 809.11 822.61 833.22 852.90 866.41 883.55 909.02 932.37 948.47 951.94 955.53 956.40 961.69 985.76 1005.43 1019.33 1038.49 1040.48 1041.94 1046.28 1050.68 1051.24 1059.92 1082.59 1089.10 1091.65 1097.27 1108.90 1110.57 1122.70 1133.05 1136.57 1160.16 1173.40 1175.92 1191.85 1217.06 1242.86 1253.94 1278.22 1293.53 1295.67 1305.60 1339.80 1344.94 1362.21 1377.68 1381.07 1382.97 1387.82 1404.14 1407.41 1409.08 1417.38 1422.00 1423.24 1438.82 1444.42 1447.99 1463.91 1469.35 1470.60 1472.20 1476.36 1482.23 1482.83 1489.22 1492.20 1496.86 1500.95 1504.07 1507.86 1516.76 1527.08 1621.15 1638.20 1654.27 1655.77 1985.67 3004.62 3005.80 3008.16 3009.75 3010.77 3019.75 3081.60 3084.90 3085.99 3090.43 3091.73 3092.05 3117.19 3118.87 3120.11 3136.63 3144.52 3145.75 3152.62 3154.53 3188.43
frequency: 23.48 25.85 27.94 30.79 40.96 54.59 82.15 95.28 100.32 104.95 113.41 122.61 126.18 131.37 139.48 147.11 148.90 152.34 153.63 158.64 161.18 162.16 167.05 184.03 189.23 206.43 208.56 218.69 232.55 237.35 248.22 259.57 278.73 279.49 282.62 286.26 288.26 305.80 308.31 311.37 316.34 320.04 328.17 339.67 351.10 371.72 386.47 388.41 398.65 404.80 419.45 428.25 431.82 453.16 458.02 490.24 496.28 504.04 519.62 539.94 544.81 555.31 567.69 584.83 591.31 604.43 622.54 625.82 631.25 640.63 649.84 652.31 668.00 677.13 681.17 708.20 714.57 752.23 765.07 788.22 792.88 800.25 809.11 822.61 833.22 852.90 866.41 883.55 909.02 932.37 948.47 951.94 955.53 956.40 961.69 985.76 1005.43 1019.33 1038.49 1040.48 1041.94 1046.28 1050.68 1051.24 1059.92 1082.59 1089.10 1091.65 1097.27 1108.90 1110.57 1122.70 1133.05 1136.57 1160.16 1173.40 1175.92 1191.85 1217.06 1242.86 1253.94 1278.22 1293.53 1295.67 1305.60 1339.80 1344.94 1362.21 1377.68 1381.07 1382.97 1387.82 1404.14 1407.41 1409.08 1417.38 1422.00 1423.24 1438.82 1444.42 1447.99 1463.91 1469.35 1470.60 1472.20 1476.36 1482.23 1482.83 1489.22 1492.20 1496.86 1500.95 1504.07 1507.86 1516.76 1527.08 1621.15 1638.20 1654.27 1655.77 1985.67 3004.62 3005.80 3008.16 3009.75 3010.77 3019.75 3081.60 3084.90 3085.99 3090.43 3091.73 3092.05 3117.19 3118.87 3120.11 3136.63 3144.52 3145.75 3152.62 3154.53 3188.43
formula: C29H22BF10Rh
InChI: InChI=1/C19H6BF10.C10H15.Rh.H/c21-11-7-6-4-1-2-5(3-4)8(6)20(30,9(7)12(22)16(26)15(11)25)10-13(23)17(27)19(29)18(28)14(10)24;1-6-7(2)9(4)10(5)8(6)3;;/h1-2,4-5H,3H2;1-5H3;;/rC29H22BF10Rh/c1-23-24(2)26(4)27(5)25(23,3)41(23,24,26,27)21-7-6-8(22(21)41)29(41)28(7,41)9-10(13(32)17(36)16(35)12(9)31)30(29,40)11-14(33)18(37)20(39)19(38)15(11)34/h7-8,21-22,41H,6H2,1-5H3
63 atoms
C  -0.368697 -1.738731 0.56586
C  -0.094179 -0.42801 -0.013952
C  0.236342 -0.563653 -1.379294
C  -0.125255 -2.794322 -0.344349
C  3.294697 -4.130456 1.489281
C  3.342431 -3.043976 2.427472
C  3.261251 -3.582036 0.171542
C  3.39908 -1.803778 1.682007
C  3.334219 -2.134557 0.297418
Rh 1.44451 -2.832067 1.29828
C  -0.073735 0.803892 0.616956
C  0.591909 0.574248 -2.067435
C  0.613501 1.824223 -1.44818
C  0.280196 1.939283 -0.10055
F  -0.358493 0.919713 1.932395
F  0.313798 3.139823 0.492825
F  0.944261 2.925816 -2.133076
F  0.909123 0.525834 -3.374685
B  0.127679 -2.13453 -1.843709
C  -1.261406 -2.509287 -2.643894
C  -2.347477 -1.667195 -2.858976
C  -1.414508 -3.8037 -3.138399
C  -3.494836 -2.058416 -3.541254
C  -2.540076 -4.238373 -3.824468
C  -3.590832 -3.353596 -4.029201
F  -0.441251 -4.718173 -2.94296
F  -2.342907 -0.399558 -2.399028
F  -4.507315 -1.202043 -3.732005
F  -4.685553 -3.747235 -4.687357
F  -2.632252 -5.495263 -4.281018
C  -0.948536 -3.966723 0.20348
C  -1.358124 -2.246985 1.632463
C  -2.188835 -3.239841 0.784128
C  -0.427388 -3.207297 2.402394
C  -0.137775 -4.263078 1.470372
C  3.315616 -5.580592 1.838332
C  3.458175 -3.179819 3.909644
C  3.333604 -4.352968 -1.102235
C  3.471986 -1.166745 -0.823416
C  3.59154 -0.433583 2.243385
H  4.350804 -5.935898 1.921819
H  2.826133 -5.77504 2.796871
H  2.821803 -6.183542 1.072683
H  4.38473 -4.511484 -1.379145
H  2.864538 -5.335312 -1.004087
H  2.83381 -3.824726 -1.91403
H  4.538498 -1.024455 -1.045481
H  2.975025 -1.519961 -1.727812
H  3.053959 -0.191377 -0.561647
H  4.655506 -0.163297 2.237642
H  3.056113 0.315326 1.653818
H  3.234137 -0.36316 3.273291
H  4.51033 -3.297533 4.199219
H  3.06895 -2.298506 4.424903
H  2.915884 -4.055338 4.276883
H  -1.876258 -1.495579 2.228148
H  -2.832694 -3.892039 1.388393
H  -2.77999 -2.735563 0.011158
H  -1.111186 -4.809261 -0.466925
H  -0.48205 -3.362128 3.477519
H  0.21161 -5.25087 1.752102
H  0.732165 -2.159858 2.571601
F  1.235369 -2.557661 -2.611669
totalener: -2252.00711775584296 hartree
nucrepener: 5743.08200839823803 hartree
electener: -7995.08912615408099 hartree
twoeener: 6586.03613546775614 hartree
kineticenergy: 2173.63429749975558 hartree
exchangeener: -274.830735530712 hartree
correlationener: -10.484910320573 hartree
xcener: -285.315645851285 hartree
dispersion: -0.040340403 hartree
dispersion: -0.040300094 hartree
dispersion: -0.040314366 hartree
dispersion: -0.040335330 hartree
dispersion: -0.040306938 hartree
dispersion: -0.040319185 hartree
dispersion: -0.040315066 hartree
energy: -667.0863 -667.0747 -667.0489 -666.9715 -666.9315 -666.8937 -666.6120 -666.5955 -666.4746 -664.3886 -275.7880 -275.7866 -275.7058 -275.6432 -275.6006 -275.5872 -275.5233 -275.5050 -275.3460 -275.1093 -274.7335 -274.5947 -274.5339 -274.4861 -274.4525 -274.3824 -274.1866 -274.1759 -273.9377 -273.8804 -273.8226 -273.7212 -273.6540 -273.5489 -273.3717 -273.2061 -273.2049 -273.0030 -272.7697 -180.2098 -88.1538 -54.9744 -54.2930 -54.0173 -32.9556 -32.9467 -32.6644 -32.6576 -32.4978 -32.4673 -32.1671 -32.1517 -32.0599 -29.5748 -24.5187 -24.2649 -23.0611 -22.9932 -21.2877 -21.1739 -21.1531 -19.9904 -19.8212 -19.7401 -19.7237 -19.5861 -19.3714 -19.2905 -19.2122 -18.7020 -16.9799 -16.9204 -16.8464 -16.6660 -16.6026 -16.5204 -15.4641 -15.2617 -14.8746 -14.7298 -14.4710 -14.4244 -14.3027 -14.1659 -14.0923 -14.0877 -13.8801 -13.4796 -13.4676 -13.3171 -13.1873 -13.0806 -12.8638 -12.8037 -12.7081 -12.5401 -12.4766 -12.3487 -12.0903 -11.9563 -11.8863 -11.8448 -11.6674 -11.6359 -11.5909 -11.5336 -11.4584 -11.3917 -11.1803 -11.1121 -11.1116 -11.0608 -10.9538 -10.7957 -10.7235 -10.6878 -10.5648 -10.5123 -10.4907 -10.4608 -10.4253 -10.4018 -10.3704 -10.2212 -10.0403 -9.9335 -9.7774 -9.7208 -9.6512 -9.5740 -9.4112 -9.3628 -9.3351 -9.2042 -9.1481 -9.1121 -8.9803 -8.9658 -8.8712 -8.5570 -8.3405 -8.2863 -7.9177 -7.7068 -7.2509 -7.1474 -7.0375 -6.8008 -6.6984 -6.1428 -5.9691 -5.8814 -5.8586 -5.5469 -2.7977 -2.2585 -1.8610 -1.0031 -0.7415 -0.6743 -0.5350 -0.3311 -0.1348 -0.0813 -0.0316 electronvolt
chargesum: 0.0000000
charge: -0.222265 0.174123 0.041637 0.176375 0.096765 0.196155 0.249701 0.178658 0.192266 -0.523164 0.010639 0.180962 0.104194 0.130020 -0.208617 -0.185138 -0.178041 -0.193545 0.296038 -0.005304 0.276378 0.200224 0.062568 0.058002 0.167559 -0.207171 -0.202656 -0.182431 -0.184557 -0.183966 0.126936 0.137924 -0.549926 -0.166747 -0.270403 -0.596256 -0.544991 -0.580628 -0.672471 -0.555583 0.175045 0.154408 0.168490 0.164081 0.144993 0.223386 0.167868 0.225541 0.164871 0.170641 0.170211 0.149716 0.174434 0.160545 0.152613 0.184873 0.162120 0.187065 0.188555 0.193485 0.182185 0.109129 -0.417520
charge: -0.024218 -0.031459 -0.075747 -0.046009 -0.047091 -0.049610 -0.045220 -0.063578 -0.024619 -0.428549 0.224119 0.227417 0.230451 0.224154 -0.267690 -0.248204 -0.244752 -0.252828 0.103389 -0.091419 0.233702 0.232633 0.218933 0.219104 0.231714 -0.258394 -0.255104 -0.247822 -0.241826 -0.249466 -0.142819 -0.147045 -0.229651 -0.108653 -0.113195 -0.367671 -0.365438 -0.364880 -0.355924 -0.362660 0.173661 0.167061 0.172123 0.168979 0.167950 0.198983 0.173984 0.200754 0.178017 0.169193 0.175839 0.167563 0.173099 0.170273 0.168337 0.181566 0.167449 0.180941 0.184073 0.181921 0.186274 0.249464 -0.351577
qa: -0.2223 0.1741 0.0416 0.1764 0.0968 0.1962 0.2497 0.1787 0.1923 -0.5232 0.0106 0.1810 0.1042 0.1300 -0.2086 -0.1851 -0.1780 -0.1935 0.2960 -0.0053 0.2764 0.2002 0.0626 0.0580 0.1676 -0.2072 -0.2027 -0.1824 -0.1846 -0.1840 0.1269 0.1379 -0.5499 -0.1667 -0.2704 -0.5963 -0.5450 -0.5806 -0.6725 -0.5556 0.1750 0.1544 0.1685 0.1641 0.1450 0.2234 0.1679 0.2255 0.1649 0.1706 0.1702 0.1497 0.1744 0.1605 0.1526 0.1849 0.1621 0.1871 0.1886 0.1935 0.1822 0.1091 -0.4175
va: 3.6387 3.3418 3.2794 3.0902 3.7924 3.4819 3.3810 3.6516 3.6431 4.7610 3.5932 3.5322 3.6288 3.6569 1.0015 1.0261 1.0303 1.0049 3.8718 3.3951 3.4544 3.6523 3.6512 3.6873 3.6302 0.9994 1.0006 1.0226 1.0338 1.0254 3.5264 3.4601 3.7532 3.6093 3.8297 3.7323 3.7418 3.6887 3.6056 3.7437 0.9543 0.9621 0.9598 0.9559 0.9643 0.9488 0.9564 0.9435 0.9612 0.9547 0.9603 0.9646 0.9541 0.9628 0.9638 0.9578 0.9624 0.9532 0.9546 0.9512 0.9655 1.0066 0.8885
dispersion: -0.040316569 hartree
energy: -2252.016400714312 hartree
dipole: -29.432135161 31.722075400 2.289940238 22.386456572 -24.397696037 -2.011239465 -63.897525532 68.032019000 4.134493467
dipolemethod: SCF
magnitude: 5.136433267 au
magnitude: 13.055775806 debye
temp: 298.15 k
press: 1.00 atm
zeropoint: 0.44084038 hartree
thermalvibcorrection: 0.03538830 hartree
thermalrotcorrection: 0.00141627 hartree
thermaltrasncorrection: 0.00141627 hartree
thermaltotal: -2251.53733949 hartree
thermalcorr: 0.03822085 hartree
nonthermalcorr: 0.44084038 hartree
totalcorr: 0.47906122 hartree
thermalcorrenthalpy: 0.00094421 hartree
totalenthalpy: -2251.53639528 hartree
vibrat: 0.06276168 hartree
rotat: 0.01793346 hartree
transl: 0.02157398 hartree
total: 0.10226913 hartree
totalentropycorr: -0.10226913 hartree
gibbsenthalpy: -2251.63866441 hartree
gibbsminuselec: 0.37773631 hartree
