program: Orca
programVersion: 6.0.1
elementType: C C C C C C C C C Rh C C C C F F F F B C C C C C C F F F F F C C C C C C C C C C H H H H H H H H H H H H H H H H H H H H H H F
elementType: Rh
charge: 0
multiplicity: 1
keywords: OPT FREQ r2scan-3c
frequency: 0.00 0.00 0.00 0.00 0.00 0.00 20.35 26.66 29.39 34.88 42.38 58.74 87.48 90.29 102.33 106.41 113.77 121.64 131.71 132.63 138.76 144.46 148.22 154.79 155.03 160.18 165.82 173.92 176.61 183.07 192.07 201.33 208.05 215.02 223.96 232.36 238.46 254.69 268.17 278.81 281.24 287.59 288.13 300.94 304.76 306.26 317.87 320.27 326.12 331.54 341.26 350.45 373.19 383.62 388.33 392.78 404.29 426.84 431.93 441.60 452.99 455.89 488.03 497.64 513.81 524.13 536.11 544.21 554.25 567.83 583.92 590.79 604.02 616.13 622.31 631.08 637.26 652.22 658.63 667.65 678.26 696.99 714.98 741.50 763.96 782.68 788.76 801.53 806.57 824.58 828.19 863.68 878.90 890.72 894.21 925.38 952.05 956.94 961.90 962.69 971.22 983.91 994.55 1012.43 1033.34 1034.27 1035.46 1038.60 1046.33 1052.34 1054.66 1064.44 1089.23 1091.54 1092.94 1106.56 1110.90 1122.13 1134.90 1137.11 1158.50 1167.39 1175.41 1179.81 1216.74 1243.80 1252.15 1278.55 1290.04 1294.22 1296.19 1309.29 1339.32 1345.72 1374.45 1382.18 1382.76 1399.03 1399.96 1406.02 1409.27 1410.45 1417.09 1424.14 1436.45 1445.21 1452.04 1461.45 1467.28 1469.23 1474.01 1476.70 1478.49 1482.01 1488.88 1489.82 1494.35 1499.45 1502.18 1507.23 1523.67 1526.55 1538.40 1620.30 1637.33 1651.99 1656.37 2288.08 3004.04 3005.38 3007.08 3007.97 3011.27 3017.26 3053.72 3081.52 3085.69 3087.30 3089.15 3091.67 3098.79 3115.20 3118.28 3131.33 3131.55 3133.19 3138.21 3142.18 3153.10
frequency: 20.35 26.66 29.39 34.88 42.38 58.74 87.48 90.29 102.33 106.41 113.77 121.64 131.71 132.63 138.76 144.46 148.22 154.79 155.03 160.18 165.82 173.92 176.61 183.07 192.07 201.33 208.05 215.02 223.96 232.36 238.46 254.69 268.17 278.81 281.24 287.59 288.13 300.94 304.76 306.26 317.87 320.27 326.12 331.54 341.26 350.45 373.19 383.62 388.33 392.78 404.29 426.84 431.93 441.60 452.99 455.89 488.03 497.64 513.81 524.13 536.11 544.21 554.25 567.83 583.92 590.79 604.02 616.13 622.31 631.08 637.26 652.22 658.63 667.65 678.26 696.99 714.98 741.50 763.96 782.68 788.76 801.53 806.57 824.58 828.19 863.68 878.90 890.72 894.21 925.38 952.05 956.94 961.90 962.69 971.22 983.91 994.55 1012.43 1033.34 1034.27 1035.46 1038.60 1046.33 1052.34 1054.66 1064.44 1089.23 1091.54 1092.94 1106.56 1110.90 1122.13 1134.90 1137.11 1158.50 1167.39 1175.41 1179.81 1216.74 1243.80 1252.15 1278.55 1290.04 1294.22 1296.19 1309.29 1339.32 1345.72 1374.45 1382.18 1382.76 1399.03 1399.96 1406.02 1409.27 1410.45 1417.09 1424.14 1436.45 1445.21 1452.04 1461.45 1467.28 1469.23 1474.01 1476.70 1478.49 1482.01 1488.88 1489.82 1494.35 1499.45 1502.18 1507.23 1523.67 1526.55 1538.40 1620.30 1637.33 1651.99 1656.37 2288.08 3004.04 3005.38 3007.08 3007.97 3011.27 3017.26 3053.72 3081.52 3085.69 3087.30 3089.15 3091.67 3098.79 3115.20 3118.28 3131.33 3131.55 3133.19 3138.21 3142.18 3153.10
formula: C29H22BF10Rh
InChI: InChI=1/C19H7BF10.C10H15.Rh/c21-11-7-6-4-1-2-5(3-4)8(6)20(30,9(7)12(22)16(26)15(11)25)10-13(23)17(27)19(29)18(28)14(10)24;1-6-7(2)9(4)10(5)8(6)3;/h1,4-5H,2-3H2;1-5H3;/rC29H22BF10Rh/c1-22-23(2)25(4)26(5)24(22,3)41(22,23,25,26)21-7-6-8(28(21,41)42-41)29(41)27(7,41)9-10(13(32)17(36)16(35)12(9)31)30(29,40)11-14(33)18(37)20(39)19(38)15(11)34/h7-8,21,28H,6H2,1-5H3
63 atoms
C  -0.99082 -0.428188 1.104541
C  -0.999138 0.706451 0.184588
C  -0.413706 0.33153 -1.046214
C  -0.366346 -1.559991 0.546621
C  3.183879 -0.449567 1.713014
C  3.001379 -0.675652 3.133601
C  2.440221 0.708199 1.378026
C  2.185516 0.367839 3.679709
C  1.788156 1.20953 2.58946
Rh 0.981672 -0.782303 2.200149
C  -1.510628 1.977749 0.382441
C  -0.331925 1.287381 -2.031955
C  -0.833514 2.576225 -1.845938
C  -1.428528 2.92117 -0.635157
F  -2.080487 2.332608 1.555553
F  -1.916443 4.156227 -0.460248
F  -0.767563 3.489005 -2.82223
F  0.211898 1.003133 -3.229379
B  0.074624 -1.243301 -1.005356
C  -0.804078 -2.273283 -1.931693
C  -1.943882 -1.970967 -2.66894
C  -0.421488 -3.613593 -1.965523
C  -2.643177 -2.913316 -3.416283
C  -1.086992 -4.587812 -2.695816
C  -2.210517 -4.23134 -3.430261
F  0.642326 -4.025077 -1.243064
F  -2.440056 -0.717237 -2.693441
F  -3.730048 -2.566837 -4.119334
F  -2.873108 -5.152695 -4.137146
F  -0.673031 -5.863298 -2.692047
C  -0.977014 -2.756012 1.312368
C  -1.887562 -0.892344 2.246135
C  -2.389977 -2.233858 1.660917
C  -0.764052 -1.317938 3.200614
C  -0.265392 -2.641148 2.674838
C  4.054207 -1.233085 0.788575
C  3.630777 -1.781412 3.910879
C  2.441781 1.392099 0.05859
C  1.048192 2.497523 2.700763
C  1.847967 0.570534 5.118929
H  5.058331 -0.791174 0.738349
H  4.165027 -2.269035 1.119027
H  3.629756 -1.250557 -0.217365
H  3.348037 2.00857 -0.018303
H  2.438173 0.673915 -0.764085
H  1.580488 2.051623 -0.059036
H  1.749754 3.312107 2.926148
H  0.540664 2.74955 1.768014
H  0.29865 2.467298 3.494858
H  2.627973 1.161002 5.616737
H  0.903073 1.107474 5.232324
H  1.76316 -0.379285 5.654411
H  4.629312 -1.477075 4.25048
H  3.045706 -2.040342 4.79733
H  3.753516 -2.679963 3.300899
H  -2.617052 -0.185856 2.640147
H  -2.918697 -2.858544 2.392918
H  -3.012727 -2.090935 0.770537
H  -0.898642 -3.726318 0.821408
H  -0.818375 -1.116243 4.268015
H  0.886752 -2.64612 2.446187
H  -0.314103 -3.483904 3.374001
F  1.455217 -1.376885 -1.306226
totalener: -2252.01359219661845 hartree
nucrepener: 5735.49661012708020 hartree
electener: -7987.51020232369865 hartree
twoeener: 6578.75168465964907 hartree
kineticenergy: 2173.65499914182510 hartree
exchangeener: -274.839826253915 hartree
correlationener: -10.481138160028 hartree
xcener: -285.320964413943 hartree
dispersion: -0.040258045 hartree
dispersion: -0.040253127 hartree
dispersion: -0.040282610 hartree
dispersion: -0.040259154 hartree
dispersion: -0.040249924 hartree
dispersion: -0.040238614 hartree
dispersion: -0.040253384 hartree
dispersion: -0.040252513 hartree
dispersion: -0.040262053 hartree
dispersion: -0.040260953 hartree
dispersion: -0.040261054 hartree
dispersion: -0.040258405 hartree
dispersion: -0.040256852 hartree
dispersion: -0.040255873 hartree
energy: -667.1333 -667.0902 -667.0103 -667.0064 -666.8739 -666.8241 -666.5470 -666.5218 -666.4939 -664.2080 -275.8382 -275.7508 -275.7150 -275.7038 -275.5308 -275.5141 -275.4483 -275.4286 -275.3659 -274.8674 -274.7221 -274.6880 -274.6017 -274.5922 -274.3120 -274.2463 -274.1693 -273.9912 -273.9280 -273.9157 -273.8480 -273.7785 -273.6300 -273.4736 -273.3365 -273.2601 -273.1641 -272.9106 -272.7813 -180.0503 -87.8771 -54.7399 -54.0504 -53.6820 -33.0021 -32.8793 -32.7057 -32.5895 -32.5102 -32.4285 -32.1015 -32.0943 -32.0666 -29.3437 -24.5111 -24.1661 -23.0814 -22.9209 -21.3190 -21.2417 -21.1672 -19.9156 -19.7810 -19.7533 -19.6549 -19.6429 -19.3522 -19.3254 -19.2558 -18.6820 -17.0055 -16.9434 -16.8992 -16.6941 -16.5810 -16.4614 -15.4864 -15.3127 -14.8127 -14.7449 -14.4181 -14.3900 -14.2452 -14.1520 -14.1403 -14.1152 -13.7937 -13.5193 -13.4027 -13.2948 -13.2295 -12.9659 -12.9310 -12.7287 -12.7223 -12.5469 -12.3929 -12.2907 -12.0800 -12.0070 -11.9027 -11.8725 -11.6867 -11.6536 -11.6424 -11.5858 -11.4516 -11.4087 -11.1410 -11.1095 -11.0568 -11.0013 -10.9378 -10.7664 -10.6775 -10.6599 -10.5909 -10.5153 -10.4916 -10.4584 -10.3877 -10.3849 -10.2939 -10.1748 -9.9893 -9.9440 -9.7603 -9.6482 -9.5465 -9.5237 -9.3659 -9.3458 -9.2471 -9.2355 -9.1656 -9.0866 -9.0184 -8.9044 -8.7270 -8.5822 -8.2729 -8.1491 -7.9076 -7.3603 -7.2353 -7.0557 -6.9145 -6.6194 -6.5252 -6.0857 -5.9859 -5.7982 -5.7163 -5.5393 -3.3517 -2.2140 -1.8818 -0.7769 -0.6928 -0.4613 -0.3403 -0.2274 -0.1860 -0.1174 -0.0088 electronvolt
chargesum: -0.0000000
charge: -0.108523 0.152614 0.016010 0.016461 0.268679 0.176340 0.118379 0.070701 0.313534 -0.423755 -0.009848 0.188198 0.116302 0.123894 -0.208480 -0.181967 -0.175547 -0.194270 0.328569 0.002342 0.261881 0.188898 0.071383 0.064140 0.163993 -0.207910 -0.203810 -0.183925 -0.185622 -0.185323 0.182013 0.081122 -0.548459 -0.232970 -0.292281 -0.566525 -0.554879 -0.674626 -0.543444 -0.581547 0.165436 0.140453 0.206870 0.166340 0.221295 0.164008 0.168975 0.171419 0.158456 0.172866 0.164099 0.153581 0.178049 0.154918 0.166243 0.178209 0.158793 0.186018 0.189583 0.185252 0.136644 0.193108 -0.422355
charge: 0.005033 -0.035934 -0.073558 -0.066825 -0.064964 -0.026184 -0.015713 -0.058216 -0.037647 -0.358300 0.209457 0.224993 0.229963 0.219583 -0.268529 -0.247355 -0.243311 -0.250402 0.104342 -0.090418 0.236748 0.230986 0.219588 0.218005 0.231156 -0.258509 -0.255172 -0.248502 -0.242826 -0.250791 -0.149033 -0.143091 -0.236066 -0.131165 -0.173157 -0.364407 -0.365420 -0.353480 -0.357723 -0.364685 0.166494 0.166338 0.191195 0.174827 0.199306 0.179202 0.172627 0.180946 0.172977 0.171244 0.171519 0.167478 0.177813 0.169344 0.173101 0.179888 0.166125 0.178841 0.182922 0.178471 0.243165 0.186687 -0.348981
qa: -0.1085 0.1526 0.0160 0.0165 0.2687 0.1763 0.1184 0.0707 0.3135 -0.4238 -0.0098 0.1882 0.1163 0.1239 -0.2085 -0.1820 -0.1755 -0.1943 0.3286 0.0023 0.2619 0.1889 0.0714 0.0641 0.1640 -0.2079 -0.2038 -0.1839 -0.1856 -0.1853 0.1820 0.0811 -0.5485 -0.2330 -0.2923 -0.5665 -0.5549 -0.6746 -0.5434 -0.5815 0.1654 0.1405 0.2069 0.1663 0.2213 0.1640 0.1690 0.1714 0.1585 0.1729 0.1641 0.1536 0.1780 0.1549 0.1662 0.1782 0.1588 0.1860 0.1896 0.1853 0.1366 0.1931 -0.4224
va: 3.5810 3.3418 3.3499 3.2177 3.5007 3.5928 3.6273 3.7249 3.3820 4.5328 3.4887 3.5271 3.5956 3.6642 0.9881 1.0282 1.0321 1.0030 3.8484 3.3854 3.5078 3.6243 3.6532 3.6828 3.6341 0.9995 1.0015 1.0225 1.0325 1.0236 3.5323 3.5443 3.7648 3.7963 3.7633 3.7226 3.7260 3.6090 3.6926 3.7492 0.9552 0.9667 0.9521 0.9561 0.9450 0.9645 0.9548 0.9637 0.9599 0.9546 0.9610 0.9633 0.9535 0.9636 0.9610 0.9608 0.9633 0.9515 0.9574 0.9629 0.9784 0.9514 0.8784
dispersion: -0.040254499 hartree
energy: -2252.022943801911 hartree
dipole: -29.379538695 31.324665251 1.945126556 8.821161902 -8.686461934 0.134699968 -65.909304690 70.777763273 4.868458583
dipolemethod: SCF
magnitude: 5.244382745 au
magnitude: 13.330161572 debye
temp: 298.15 k
press: 1.00 atm
zeropoint: 0.44345800 hartree
thermalvibcorrection: 0.03566120 hartree
thermalrotcorrection: 0.00141627 hartree
thermaltrasncorrection: 0.00141627 hartree
thermaltotal: -2251.54099206 hartree
thermalcorr: 0.03849374 hartree
nonthermalcorr: 0.44345800 hartree
totalcorr: 0.48195174 hartree
thermalcorrenthalpy: 0.00094421 hartree
totalenthalpy: -2251.54004785 hartree
vibrat: 0.06316366 hartree
rotat: 0.01793942 hartree
transl: 0.02157398 hartree
total: 0.10267706 hartree
totalentropycorr: -0.10267706 hartree
gibbsenthalpy: -2251.64272492 hartree
gibbsminuselec: 0.38021889 hartree
