program: Orca
programVersion: 6.0.1
elementType: C C C C C C C C C Rh C C C C F F F F B C C C C C C F F F F F C C C C C C C C C C H H H H H H H H H H H H H H H H H H H H H H F H H
elementType: Rh
charge: 0
multiplicity: 1
keywords: OPTTS FREQ r2scan-3c
frequency: 0.00 0.00 0.00 0.00 0.00 0.00 -550.67 21.77 26.37 29.70 32.65 44.34 55.09 80.49 88.85 101.50 105.89 113.72 123.18 130.69 143.67 145.77 149.81 154.02 156.95 159.61 165.81 169.00 170.47 176.14 180.69 186.75 193.50 197.99 217.32 223.07 228.57 237.33 256.51 274.14 277.99 280.26 285.86 286.33 288.50 296.23 307.76 313.61 319.26 323.82 336.32 349.44 359.78 369.28 386.18 389.76 396.18 400.57 421.08 425.79 450.27 453.27 471.99 495.11 498.73 515.33 522.38 532.80 543.14 549.47 560.91 572.74 584.21 591.24 597.19 614.82 624.47 634.05 636.72 637.10 652.73 656.86 669.61 679.81 695.79 708.81 740.98 752.96 766.03 787.46 799.19 802.71 814.20 829.80 855.85 865.49 889.64 914.40 926.20 944.58 950.88 953.50 964.79 968.16 985.23 995.71 1013.46 1036.66 1037.39 1043.68 1047.92 1050.41 1052.80 1067.18 1082.82 1086.48 1090.21 1106.36 1108.95 1115.26 1120.43 1134.51 1136.17 1154.86 1161.40 1171.49 1176.24 1184.55 1209.78 1255.01 1268.07 1279.75 1294.24 1296.29 1302.88 1318.11 1338.52 1344.29 1368.67 1378.18 1380.65 1388.60 1404.19 1405.15 1408.31 1411.79 1413.69 1425.20 1435.98 1444.21 1451.10 1461.92 1470.45 1473.25 1473.81 1476.00 1479.07 1482.64 1488.51 1489.87 1492.87 1496.09 1500.95 1503.21 1508.57 1524.76 1527.21 1623.83 1637.44 1654.63 1655.54 2145.74 2200.16 2984.46 3005.32 3008.91 3009.50 3010.18 3014.25 3025.12 3076.25 3080.31 3087.72 3089.58 3092.00 3093.80 3096.96 3120.19 3122.96 3127.80 3127.83 3129.02 3133.29 3148.58 3158.38
frequency: 21.77 26.37 29.70 32.65 44.34 55.09 80.49 88.85 101.50 105.89 113.72 123.18 130.69 143.67 145.77 149.81 154.02 156.95 159.61 165.81 169.00 170.47 176.14 180.69 186.75 193.50 197.99 217.32 223.07 228.57 237.33 256.51 274.14 277.99 280.26 285.86 286.33 288.50 296.23 307.76 313.61 319.26 323.82 336.32 349.44 359.78 369.28 386.18 389.76 396.18 400.57 421.08 425.79 450.27 453.27 471.99 495.11 498.73 515.33 522.38 532.80 543.14 549.47 560.91 572.74 584.21 591.24 597.19 614.82 624.47 634.05 636.72 637.10 652.73 656.86 669.61 679.81 695.79 708.81 740.98 752.96 766.03 787.46 799.19 802.71 814.20 829.80 855.85 865.49 889.64 914.40 926.20 944.58 950.88 953.50 964.79 968.16 985.23 995.71 1013.46 1036.66 1037.39 1043.68 1047.92 1050.41 1052.80 1067.18 1082.82 1086.48 1090.21 1106.36 1108.95 1115.26 1120.43 1134.51 1136.17 1154.86 1161.40 1171.49 1176.24 1184.55 1209.78 1255.01 1268.07 1279.75 1294.24 1296.29 1302.88 1318.11 1338.52 1344.29 1368.67 1378.18 1380.65 1388.60 1404.19 1405.15 1408.31 1411.79 1413.69 1425.20 1435.98 1444.21 1451.10 1461.92 1470.45 1473.25 1473.81 1476.00 1479.07 1482.64 1488.51 1489.87 1492.87 1496.09 1500.95 1503.21 1508.57 1524.76 1527.21 1623.83 1637.44 1654.63 1655.54 2145.74 2200.16 2984.46 3005.32 3008.91 3009.50 3010.18 3014.25 3025.12 3076.25 3080.31 3087.72 3089.58 3092.00 3093.80 3096.96 3120.19 3122.96 3127.80 3127.83 3129.02 3133.29 3148.58 3158.38
formula: C29H24BF10Rh
InChI: InChI=1/C19H7BF10.C10H15.Rh.2H/c21-11-7-6-4-1-2-5(3-4)8(6)20(30,9(7)12(22)16(26)15(11)25)10-13(23)17(27)19(29)18(28)14(10)24;1-6-7(2)9(4)10(5)8(6)3;;;/h1,4-5H,2-3H2;1-5H3;;;/rC29H24BF10Rh/c1-24-25(2)27(4)28(5)26(24,3)41(24,25,27,28)10-7-8-6-9(10)29(41)11-12(15(32)19(36)18(35)14(11)31)30(40,23(8)29)13-16(33)20(37)22(39)21(38)17(13)34/h8-10H,6-7,41H2,1-5H3
65 atoms
C  -1.138731 -0.174135 1.370394
C  -1.237319 0.958304 0.438119
C  -0.351152 0.77781 -0.642034
C  -0.197305 -1.14105 0.942993
C  2.489975 0.802822 2.215624
C  2.620004 -0.589247 2.644755
C  2.098139 1.57166 3.343657
C  2.302946 -0.648774 4.026865
C  1.92505 0.674211 4.460195
Rh 0.412493 0.123656 2.93066
C  -2.013793 2.097548 0.550364
C  -0.253702 1.790343 -1.570404
C  -1.027051 2.946591 -1.470565
C  -1.915093 3.097368 -0.40903
F  -2.842485 2.278714 1.601678
F  -2.656558 4.208669 -0.315813
F  -0.942619 3.913205 -2.392964
F  0.562836 1.681046 -2.63542
B  0.359421 -0.693569 -0.556976
C  -0.328251 -1.807173 -1.562766
C  -1.492355 -1.645742 -2.307741
C  0.288502 -3.049938 -1.702616
C  -1.996274 -2.621168 -3.161856
C  -0.176983 -4.051858 -2.542525
C  -1.331934 -3.832795 -3.282132
F  1.38854 -3.343418 -0.976907
F  -2.213417 -0.508555 -2.231888
F  -3.115588 -2.406646 -3.865658
F  -1.801359 -4.782313 -4.096779
F  0.459986 -5.227058 -2.639697
C  -0.722731 -2.498813 1.448525
C  -2.13344 -0.91915 2.260889
C  -2.256271 -2.221054 1.440123
C  -1.171767 -1.311012 3.425112
C  -0.504466 -2.611637 2.964919
C  2.907223 1.390502 0.907995
C  3.168004 -1.703569 1.819089
C  1.982601 3.059647 3.375353
C  1.648748 1.071617 5.872297
C  2.405332 -1.834706 4.927433
H  3.609293 2.213702 1.085987
H  3.382654 0.64761 0.269901
H  2.055338 1.787872 0.34584
H  2.955127 3.501616 3.62898
H  1.680817 3.452458 2.401623
H  1.258397 3.397363 4.11997
H  2.591667 1.290107 6.390412
H  1.025472 1.967238 5.924638
H  1.146371 0.272306 6.423047
H  3.251908 -1.712488 5.614883
H  1.505199 -1.964412 5.53742
H  2.572366 -2.756185 4.365953
H  4.260211 -1.739042 1.930949
H  2.773308 -2.673038 2.133987
H  2.929434 -1.57071 0.763595
H  -3.042073 -0.38971 2.54963
H  -2.843154 -3.014752 1.91899
H  -2.651088 -2.023228 0.437471
H  -0.371085 -3.357355 0.875899
H  -1.610107 -1.346054 4.424141
H  0.5434 -2.705114 3.249618
H  -1.037881 -3.488509 3.364041
F  1.748235 -0.661046 -0.802591
H  -0.487071 1.385524 2.85248
H  -0.703774 0.274261 4.001821
totalener: -2253.17597016639502 hartree
nucrepener: 5792.94709511261226 hartree
electener: -8046.12306527900728 hartree
twoeener: 6636.00838484362612 hartree
kineticenergy: 2174.69780400263835 hartree
exchangeener: -275.478255046283 hartree
correlationener: -10.533370876280 hartree
xcener: -286.011625922564 hartree
dispersion: -0.041729580 hartree
dispersion: -0.041649968 hartree
dispersion: -0.041629137 hartree
dispersion: -0.041574573 hartree
dispersion: -0.041553040 hartree
dispersion: -0.041550385 hartree
dispersion: -0.041530800 hartree
dispersion: -0.041553792 hartree
dispersion: -0.041543454 hartree
dispersion: -0.041542156 hartree
dispersion: -0.041530684 hartree
dispersion: -0.041537135 hartree
dispersion: -0.041532099 hartree
energy: -667.0956 -667.0396 -666.9988 -666.9506 -666.9324 -666.9114 -666.6519 -666.6281 -666.4628 -664.3708 -275.8109 -275.7416 -275.6606 -275.6226 -275.6078 -275.5864 -275.5536 -275.5345 -275.3356 -274.8275 -274.6747 -274.6686 -274.5628 -274.5551 -274.5157 -274.2432 -273.9604 -273.9352 -273.9329 -273.7760 -273.6901 -273.6861 -273.6403 -273.5231 -273.4391 -273.3208 -273.2128 -273.0516 -272.7310 -180.2055 -88.4168 -55.0557 -54.6134 -54.3863 -32.9695 -32.9127 -32.6813 -32.6223 -32.5234 -32.4229 -32.1998 -32.1805 -32.0435 -29.5804 -24.4993 -23.9687 -23.0199 -22.9763 -21.3663 -21.2127 -21.0332 -19.9742 -19.7508 -19.7098 -19.6596 -19.4172 -19.3376 -19.2808 -19.1808 -18.5243 -17.0523 -16.9394 -16.8695 -16.6844 -16.6029 -16.5152 -15.4044 -15.2106 -14.8919 -14.6505 -14.4805 -14.4141 -14.2433 -14.1670 -14.1443 -14.0373 -13.6612 -13.4910 -13.4445 -13.3022 -13.1537 -13.0480 -12.8346 -12.7939 -12.7272 -12.5652 -12.4829 -12.1930 -12.0448 -11.9649 -11.8681 -11.7566 -11.7036 -11.6866 -11.6469 -11.5407 -11.4529 -11.4061 -11.2294 -11.1522 -11.1239 -11.0575 -11.0313 -10.8887 -10.7994 -10.7522 -10.7476 -10.6034 -10.5464 -10.5075 -10.4520 -10.4034 -10.2799 -10.1902 -10.0739 -9.9211 -9.8633 -9.7490 -9.6899 -9.6246 -9.4936 -9.4356 -9.3235 -9.2694 -9.2385 -9.1171 -9.0420 -8.9518 -8.8588 -8.7921 -8.6450 -8.4767 -8.3512 -8.0490 -7.8836 -7.5764 -7.1745 -7.0775 -6.8805 -6.7928 -6.1518 -5.9348 -5.9103 -5.8811 -5.6821 -3.1249 -2.3784 -1.8164 -0.9253 -0.8379 -0.6906 -0.5627 -0.3560 -0.3131 -0.1279 -0.0514 electronvolt
chargesum: 0.0000000
charge: 0.115150 0.271708 -0.018709 -0.075033 0.144420 0.202377 0.172905 0.028732 0.344746 -0.871742 0.053446 0.173763 0.113875 0.141721 -0.210521 -0.185816 -0.179886 -0.194099 0.161267 0.011196 0.256898 0.202215 0.069506 0.065453 0.160827 -0.206126 -0.203055 -0.182346 -0.183870 -0.183903 0.172851 -0.005685 -0.565236 -0.054141 -0.383488 -0.609519 -0.645465 -0.571876 -0.526655 -0.627578 0.154887 0.193067 0.199966 0.174555 0.180772 0.156498 0.175857 0.161531 0.156563 0.171766 0.176731 0.165586 0.170268 0.148222 0.234124 0.187858 0.162761 0.185785 0.185861 0.187001 0.169573 0.174370 -0.413455 0.177827 0.183719
charge: -0.036784 -0.038016 -0.082768 -0.030125 -0.044992 -0.032648 -0.048281 -0.069722 -0.051928 -0.544660 0.223281 0.227966 0.232426 0.229404 -0.268149 -0.247345 -0.245339 -0.254101 0.095630 -0.092220 0.233078 0.229031 0.219940 0.219285 0.232740 -0.260259 -0.255446 -0.247157 -0.241041 -0.248973 -0.164881 -0.147959 -0.232778 -0.154306 -0.240809 -0.358158 -0.371900 -0.365396 -0.363995 -0.375003 0.165930 0.186219 0.191469 0.171802 0.178406 0.169645 0.172507 0.171384 0.170544 0.173528 0.171880 0.170197 0.172086 0.167368 0.202044 0.179633 0.164044 0.181232 0.182445 0.167686 0.176074 0.165929 -0.347082 0.219831 0.247556
qa: 0.1151 0.2717 -0.0187 -0.0750 0.1444 0.2024 0.1729 0.0287 0.3447 -0.8717 0.0534 0.1738 0.1139 0.1417 -0.2105 -0.1858 -0.1799 -0.1941 0.1613 0.0112 0.2569 0.2022 0.0695 0.0655 0.1608 -0.2061 -0.2031 -0.1823 -0.1839 -0.1839 0.1729 -0.0057 -0.5652 -0.0541 -0.3835 -0.6095 -0.6455 -0.5719 -0.5267 -0.6276 0.1549 0.1931 0.2000 0.1746 0.1808 0.1565 0.1759 0.1615 0.1566 0.1718 0.1767 0.1656 0.1703 0.1482 0.2341 0.1879 0.1628 0.1858 0.1859 0.1870 0.1696 0.1744 -0.4135 0.1778 0.1837
va: 3.0938 3.1937 3.3622 3.4444 3.5170 3.2872 3.6539 3.5707 3.2842 5.0639 3.6312 3.5428 3.6270 3.6292 1.0018 1.0282 1.0303 1.0062 3.9128 3.3887 3.4682 3.6250 3.6483 3.6833 3.6373 0.9977 0.9992 1.0244 1.0347 1.0257 3.3146 3.7369 3.8092 3.5763 3.6437 3.7590 3.7049 3.7631 3.7567 3.7266 0.9565 0.9554 0.9476 0.9535 0.9537 0.9621 0.9541 0.9617 0.9619 0.9543 0.9511 0.9621 0.9548 0.9618 0.9419 0.9592 0.9613 0.9523 0.9591 0.9500 0.9676 0.9544 0.8916 0.9909 0.9869
dispersion: -0.041531070 hartree
energy: -2253.183831838592 hartree
dipole: -0.111896123 1.541195189 1.429299066 -30.054277835 30.058404010 0.004126175 -73.628457920 78.572406409 4.943948489
dipolemethod: SCF
magnitude: 5.146410352 au
magnitude: 13.081135539 debye
temp: 298.15 k
press: 1.00 atm
zeropoint: 0.46047124 hartree
thermalvibcorrection: 0.03600645 hartree
thermalrotcorrection: 0.00141627 hartree
thermaltrasncorrection: 0.00141627 hartree
thermaltotal: -2252.68452160 hartree
thermalcorr: 0.03883900 hartree
nonthermalcorr: 0.46047124 hartree
totalcorr: 0.49931024 hartree
thermalcorrenthalpy: 0.00094421 hartree
totalenthalpy: -2252.68357739 hartree
vibrat: 0.06357923 hartree
rotat: 0.01795775 hartree
transl: 0.02157821 hartree
total: 0.10311519 hartree
totalentropycorr: -0.10311519 hartree
gibbsenthalpy: -2252.78669259 hartree
gibbsminuselec: 0.39713925 hartree
