program: Orca
programVersion: 6.0.1
elementType: C C C C C C C C C Rh C C C C F F F F B C C C C C C F F F F F C C C C C C C C C C H H H H H H H H H H H H H H H H H H H H H H F H H
elementType: Rh
charge: 0
multiplicity: 1
keywords: OPT FREQ r2scan-3c
frequency: 0.00 0.00 0.00 0.00 0.00 0.00 20.90 27.75 29.87 31.37 38.25 56.10 73.82 88.03 102.71 106.79 111.71 117.63 121.14 129.05 131.19 136.54 146.57 147.69 155.25 157.12 159.46 161.04 167.73 170.53 178.07 191.01 201.89 209.81 219.68 223.91 234.81 253.94 258.75 277.00 281.08 284.73 285.66 288.30 295.14 298.26 304.90 311.38 320.89 324.21 331.57 346.72 352.02 367.72 387.21 389.65 400.24 414.48 425.66 445.10 452.93 453.50 474.93 493.45 505.45 517.99 533.86 538.95 550.31 559.24 583.74 588.99 602.30 613.12 619.87 630.90 636.69 643.30 652.93 659.63 670.19 682.53 700.78 713.99 748.38 765.88 777.25 786.37 789.35 798.42 812.98 816.94 826.63 861.64 873.97 881.37 893.09 914.97 948.32 950.06 954.03 960.50 975.24 983.56 1006.45 1028.10 1030.36 1036.43 1039.23 1042.82 1050.07 1051.30 1058.94 1074.47 1088.60 1091.28 1103.11 1107.69 1113.56 1120.05 1133.84 1138.36 1154.68 1166.38 1173.10 1183.70 1198.77 1220.40 1258.78 1265.78 1284.49 1293.71 1296.37 1307.54 1327.63 1339.35 1345.49 1365.45 1371.13 1375.64 1382.22 1397.64 1404.69 1406.97 1410.66 1413.14 1415.24 1422.35 1449.76 1454.02 1457.26 1465.84 1469.46 1473.65 1475.58 1480.03 1481.33 1482.95 1485.97 1489.79 1492.92 1498.64 1506.19 1515.42 1526.96 1537.21 1546.57 1624.01 1638.07 1654.29 1655.98 2084.70 2647.76 3006.00 3006.24 3006.59 3009.27 3011.26 3015.67 3031.01 3056.46 3075.49 3076.66 3082.28 3095.34 3095.67 3099.09 3102.88 3122.14 3122.90 3126.10 3126.92 3132.63 3149.22 3166.21
frequency: 20.90 27.75 29.87 31.37 38.25 56.10 73.82 88.03 102.71 106.79 111.71 117.63 121.14 129.05 131.19 136.54 146.57 147.69 155.25 157.12 159.46 161.04 167.73 170.53 178.07 191.01 201.89 209.81 219.68 223.91 234.81 253.94 258.75 277.00 281.08 284.73 285.66 288.30 295.14 298.26 304.90 311.38 320.89 324.21 331.57 346.72 352.02 367.72 387.21 389.65 400.24 414.48 425.66 445.10 452.93 453.50 474.93 493.45 505.45 517.99 533.86 538.95 550.31 559.24 583.74 588.99 602.30 613.12 619.87 630.90 636.69 643.30 652.93 659.63 670.19 682.53 700.78 713.99 748.38 765.88 777.25 786.37 789.35 798.42 812.98 816.94 826.63 861.64 873.97 881.37 893.09 914.97 948.32 950.06 954.03 960.50 975.24 983.56 1006.45 1028.10 1030.36 1036.43 1039.23 1042.82 1050.07 1051.30 1058.94 1074.47 1088.60 1091.28 1103.11 1107.69 1113.56 1120.05 1133.84 1138.36 1154.68 1166.38 1173.10 1183.70 1198.77 1220.40 1258.78 1265.78 1284.49 1293.71 1296.37 1307.54 1327.63 1339.35 1345.49 1365.45 1371.13 1375.64 1382.22 1397.64 1404.69 1406.97 1410.66 1413.14 1415.24 1422.35 1449.76 1454.02 1457.26 1465.84 1469.46 1473.65 1475.58 1480.03 1481.33 1482.95 1485.97 1489.79 1492.92 1498.64 1506.19 1515.42 1526.96 1537.21 1546.57 1624.01 1638.07 1654.29 1655.98 2084.70 2647.76 3006.00 3006.24 3006.59 3009.27 3011.26 3015.67 3031.01 3056.46 3075.49 3076.66 3082.28 3095.34 3095.67 3099.09 3102.88 3122.14 3122.90 3126.10 3126.92 3132.63 3149.22 3166.21
formula: C29H24BF10Rh
InChI: InChI=1/C19H8BF10.C10H15.Rh.H/c21-11-7-6-4-1-2-5(3-4)8(6)20(30,9(7)12(22)16(26)15(11)25)10-13(23)17(27)19(29)18(28)14(10)24;1-6-7(2)9(4)10(5)8(6)3;;/h4-5H,1-3H2;1-5H3;;/rC29H24BF10Rh/c1-23-24(2)26(4)27(5)25(23,3)41(23,24,26,27)28-9-6-7-10(8-9)29(28,41)30(40,12-11(28)14(31)18(35)19(36)15(12)32)13-16(33)20(37)22(39)21(38)17(13)34/h9-10,41H,6-8H2,1-5H3
65 atoms
C  -1.103176 -0.095602 1.438523
C  -1.170646 1.007991 0.468024
C  -0.32145 0.75359 -0.624696
C  -0.184919 -1.105625 1.043818
C  2.46846 0.845539 2.176169
C  2.793182 -0.523102 2.577109
C  2.05881 1.576487 3.366629
C  2.472714 -0.639734 3.941543
C  2.001122 0.650684 4.442739
Rh 0.565597 0.095312 2.854206
C  -1.887943 2.187478 0.562318
C  -0.201169 1.729512 -1.589595
C  -0.917296 2.923094 -1.510824
C  -1.76709 3.150765 -0.431582
F  -2.677111 2.444745 1.628149
F  -2.450303 4.300813 -0.354711
F  -0.812965 3.85496 -2.467441
F  0.584232 1.546575 -2.668751
B  0.35428 -0.731205 -0.48809
C  -0.32536 -1.859379 -1.479434
C  -1.471881 -1.700044 -2.250364
C  0.279919 -3.110388 -1.584872
C  -1.971799 -2.685843 -3.094925
C  -0.181438 -4.123975 -2.41329
C  -1.319424 -3.906892 -3.179122
F  1.364406 -3.401126 -0.833591
F  -2.183337 -0.554088 -2.205539
F  -3.076196 -2.472583 -3.823139
F  -1.784585 -4.867491 -3.984211
F  0.444526 -5.308056 -2.475949
C  -0.823537 -2.433294 1.510839
C  -2.212311 -0.785292 2.231425
C  -2.330169 -2.064573 1.368276
C  -1.541941 -1.352599 3.524073
C  -0.755317 -2.600069 3.038639
C  2.786552 1.505146 0.881391
C  3.416716 -1.564108 1.713183
C  1.843277 3.050823 3.415095
C  1.67771 0.946169 5.868488
C  2.598493 -1.853943 4.795262
H  3.505501 2.316109 1.056693
H  3.194682 0.801336 0.158842
H  1.890313 1.944447 0.429459
H  2.806797 3.555826 3.563175
H  1.414863 3.41614 2.479019
H  1.178768 3.338835 4.23206
H  2.598616 1.098696 6.446755
H  1.070068 1.849011 5.960084
H  1.131117 0.122222 6.336006
H  3.465888 -1.756499 5.460984
H  1.718411 -1.988415 5.432881
H  2.733425 -2.7585 4.199648
H  4.504333 -1.413208 1.684791
H  3.231157 -2.56901 2.09941
H  3.03374 -1.515038 0.693672
H  -3.116096 -0.199804 2.405896
H  -3.005337 -2.824598 1.784751
H  -2.623407 -1.837914 0.338798
H  -0.479337 -3.309398 0.959853
H  -2.276228 -1.588598 4.302686
H  0.267111 -2.649494 3.421202
H  -1.266962 -3.523704 3.334075
F  1.748339 -0.711244 -0.743506
H  -0.454615 1.266658 3.001446
H  -0.904971 -0.579572 4.045361
totalener: -2253.20161715778522 hartree
nucrepener: 5779.60352511611200 hartree
electener: -8032.80514227389722 hartree
twoeener: 6622.94712979528413 hartree
kineticenergy: 2174.78084916466923 hartree
exchangeener: -275.514467872415 hartree
correlationener: -10.524898566015 hartree
xcener: -286.039366438430 hartree
dispersion: -0.041299916 hartree
dispersion: -0.041343241 hartree
dispersion: -0.041307806 hartree
dispersion: -0.041290176 hartree
dispersion: -0.041276397 hartree
dispersion: -0.041253248 hartree
dispersion: -0.041249638 hartree
dispersion: -0.041251387 hartree
dispersion: -0.041248587 hartree
dispersion: -0.041242899 hartree
dispersion: -0.041236407 hartree
dispersion: -0.041230919 hartree
dispersion: -0.041226349 hartree
dispersion: -0.041221766 hartree
dispersion: -0.041216812 hartree
dispersion: -0.041210965 hartree
dispersion: -0.041207196 hartree
dispersion: -0.041203714 hartree
energy: -667.0104 -666.9694 -666.9020 -666.8699 -666.8601 -666.8295 -666.5547 -666.5331 -666.3848 -664.2817 -275.7137 -275.6591 -275.5784 -275.5306 -275.5158 -275.4890 -275.4438 -275.4284 -275.2444 -275.0246 -275.0090 -274.9152 -274.8681 -274.6992 -274.1831 -274.0879 -274.0685 -274.0547 -273.8924 -273.8679 -273.5874 -273.5589 -273.5543 -273.3680 -273.3458 -273.3231 -273.1731 -272.9089 -272.6160 -180.0645 -88.0831 -54.9015 -54.1391 -54.0408 -32.8800 -32.8332 -32.5922 -32.5362 -32.4319 -32.3374 -32.1001 -32.0837 -31.9603 -29.4751 -24.7052 -23.7910 -22.9227 -22.8760 -21.5735 -21.3836 -20.9668 -19.8742 -19.8085 -19.6555 -19.6211 -19.5164 -19.4510 -19.4084 -19.1583 -18.4292 -17.2616 -17.0174 -16.8580 -16.5772 -16.5071 -16.4234 -15.5846 -15.1200 -14.8084 -14.5582 -14.3834 -14.3520 -14.3336 -14.3255 -14.1462 -13.9667 -13.4961 -13.4007 -13.3496 -13.2004 -13.1792 -12.9869 -12.9274 -12.7555 -12.7156 -12.6021 -12.3860 -12.2376 -12.1020 -11.8929 -11.8889 -11.8418 -11.7988 -11.7512 -11.6900 -11.5937 -11.5615 -11.3262 -11.1293 -11.0679 -11.0439 -10.9964 -10.8974 -10.8963 -10.8353 -10.7992 -10.7369 -10.5780 -10.5034 -10.4712 -10.3768 -10.3364 -10.1679 -10.1428 -9.9923 -9.8012 -9.6759 -9.6521 -9.6070 -9.5557 -9.5289 -9.4831 -9.3932 -9.2506 -9.1998 -9.0968 -8.9376 -8.8648 -8.8255 -8.6525 -8.4111 -8.3352 -8.2520 -7.9672 -7.8800 -7.4039 -7.1854 -6.9066 -6.8977 -6.6205 -6.0640 -5.9067 -5.8191 -5.7841 -5.5948 -3.7319 -2.4048 -1.6514 -0.7451 -0.6544 -0.4725 -0.4129 -0.3018 -0.2547 -0.1095 -0.0068 electronvolt
chargesum: -0.0000000
charge: -0.045405 0.188838 -0.047179 0.008989 0.280754 0.131944 0.101557 0.120007 0.243918 -0.667150 0.036982 0.188323 0.109308 0.138766 -0.209910 -0.186898 -0.180709 -0.194968 0.238422 0.016549 0.239466 0.190931 0.072010 0.065552 0.154809 -0.207662 -0.204984 -0.183384 -0.185284 -0.185162 0.174815 0.164146 -0.563318 -0.324600 -0.350729 -0.570784 -0.650501 -0.548450 -0.534290 -0.589925 0.157432 0.207222 0.206955 0.173471 0.181351 0.157457 0.174923 0.163283 0.153065 0.176230 0.170406 0.169983 0.169018 0.142050 0.241026 0.189559 0.166776 0.190931 0.188449 0.180137 0.161012 0.172023 -0.425362 0.128801 0.169010
charge: -0.053615 -0.037256 -0.083204 -0.072390 -0.004746 -0.035732 -0.034125 -0.036850 -0.064052 -0.435804 0.223723 0.225656 0.229977 0.227537 -0.268910 -0.249023 -0.247093 -0.255056 0.100155 -0.094160 0.229604 0.228079 0.219430 0.218629 0.231207 -0.261746 -0.257318 -0.248256 -0.242634 -0.250387 -0.160150 -0.151364 -0.232904 -0.219826 -0.258579 -0.351894 -0.368850 -0.360519 -0.362311 -0.372380 0.170479 0.192972 0.196683 0.172617 0.181022 0.171099 0.172144 0.172696 0.169981 0.177893 0.172578 0.172930 0.171547 0.167213 0.205803 0.178292 0.164301 0.183256 0.181791 0.173990 0.172919 0.164096 -0.356339 0.194280 0.212894
qa: -0.0454 0.1888 -0.0472 0.0090 0.2808 0.1319 0.1016 0.1200 0.2439 -0.6671 0.0370 0.1883 0.1093 0.1388 -0.2099 -0.1869 -0.1807 -0.1950 0.2384 0.0165 0.2395 0.1909 0.0720 0.0656 0.1548 -0.2077 -0.2050 -0.1834 -0.1853 -0.1852 0.1748 0.1641 -0.5633 -0.3246 -0.3507 -0.5708 -0.6505 -0.5484 -0.5343 -0.5899 0.1574 0.2072 0.2070 0.1735 0.1814 0.1575 0.1749 0.1633 0.1531 0.1762 0.1704 0.1700 0.1690 0.1420 0.2410 0.1896 0.1668 0.1909 0.1884 0.1801 0.1610 0.1720 -0.4254 0.1288 0.1690
va: 3.4845 3.2350 3.3629 3.3986 3.4758 3.4605 3.8245 3.4968 3.4108 4.7195 3.6508 3.5094 3.6263 3.6274 1.0007 1.0260 1.0281 1.0022 3.8798 3.4031 3.4845 3.6219 3.6466 3.6810 3.6378 0.9948 0.9951 1.0241 1.0329 1.0246 3.3947 3.3988 3.7443 3.6278 3.6486 3.6845 3.7006 3.7659 3.7378 3.6986 0.9566 0.9523 0.9491 0.9536 0.9545 0.9629 0.9540 0.9626 0.9630 0.9535 0.9554 0.9616 0.9552 0.9647 0.9387 0.9552 0.9607 0.9517 0.9581 0.9548 0.9679 0.9555 0.8779 1.0049 0.9633
dispersion: -0.041201813 hartree
energy: -2253.211377566844 hartree
dipole: -9.426450941 11.134517248 1.708066307 -28.551962178 28.668222220 0.116260042 -69.431089068 74.642729894 5.211640825
dipolemethod: SCF
magnitude: 5.485636426 au
magnitude: 13.943379696 debye
temp: 298.15 k
press: 1.00 atm
zeropoint: 0.46451114 hartree
thermalvibcorrection: 0.03640130 hartree
thermalrotcorrection: 0.00141627 hartree
thermaltrasncorrection: 0.00141627 hartree
thermaltotal: -2252.70763259 hartree
thermalcorr: 0.03923384 hartree
nonthermalcorr: 0.46451114 hartree
totalcorr: 0.50374498 hartree
thermalcorrenthalpy: 0.00094421 hartree
totalenthalpy: -2252.70668838 hartree
vibrat: 0.06467625 hartree
rotat: 0.01795358 hartree
transl: 0.02157821 hartree
total: 0.10420804 hartree
totalentropycorr: -0.10420804 hartree
gibbsenthalpy: -2252.81089642 hartree
gibbsminuselec: 0.40048115 hartree
