program: Orca
programVersion: 6.0.1
elementType: C C C C C C C C C Rh C C C C F F F F B C C C C C C F F F F F C C C C C C C C C C H H H H H H H H H H H H H H H H H H H H H H F
elementType: Rh
charge: 0
multiplicity: 1
keywords: r2scan0 d4 ma-def2-qzvp SP TIGHTSCF AIM NBO SMD(toluene)
formula: C29H22BF10Rh
InChI: InChI=1/C19H7BF10.C10H15.Rh/c21-11-7-6-4-1-2-5(3-4)8(6)20(30,9(7)12(22)16(26)15(11)25)10-13(23)17(27)19(29)18(28)14(10)24;1-6-7(2)9(4)10(5)8(6)3;/h2,4-5H,1,3H2;1-5H3;/rC29H22BF10Rh/c1-23-24(2)26(4)27(5)25(23,3)41(23,24,26,27)21-7-6-8(22(21)41)29(41)28(7,41)9-10(13(32)17(36)16(35)12(9)31)30(29,40)11-14(33)18(37)20(39)19(38)15(11)34/h7-8,22H,6,21H2,1-5H3
63 atoms
C  -0.349518 -1.772655 0.553105
C  -0.044483 -0.464791 -0.012326
C  0.262364 -0.591177 -1.385136
C  -0.126067 -2.823638 -0.363074
C  3.341873 -4.107016 1.510004
C  3.379931 -3.001993 2.418933
C  3.257162 -3.569069 0.182515
C  3.405168 -1.76362 1.663901
C  3.331897 -2.107352 0.293016
Rh 1.481668 -2.910261 1.252736
C  0.014648 0.759872 0.631776
C  0.628668 0.547102 -2.06675
C  0.684634 1.789434 -1.434696
C  0.378972 1.895573 -0.079237
F  -0.241853 0.866322 1.954168
F  0.449547 3.088375 0.526477
F  1.023588 2.892322 -2.113228
F  0.925718 0.506683 -3.378929
B  0.124803 -2.156206 -1.861535
C  -1.276565 -2.505459 -2.649611
C  -2.350066 -1.645132 -2.853834
C  -1.453315 -3.795492 -3.147733
C  -3.508096 -2.015357 -3.529812
C  -2.590209 -4.209272 -3.8279
C  -3.6279 -3.306875 -4.022167
F  -0.493018 -4.725119 -2.962968
F  -2.32151 -0.379426 -2.389122
F  -4.507931 -1.141966 -3.710683
F  -4.732866 -3.68035 -4.675146
F  -2.705143 -5.462284 -4.289786
C  -0.952036 -3.984881 0.195603
C  -1.355831 -2.251328 1.614008
C  -2.185043 -3.251358 0.775899
C  -0.475943 -3.207487 2.447436
C  -0.085458 -4.257392 1.428995
C  3.407364 -5.552775 1.872895
C  3.461451 -3.102553 3.904422
C  3.325271 -4.3443 -1.085878
C  3.444294 -1.163553 -0.847748
C  3.546568 -0.387225 2.225078
H  4.450363 -5.891108 1.92042
H  2.95404 -5.74681 2.849024
H  2.89278 -6.17033 1.133027
H  4.372315 -4.432945 -1.407171
H  2.927203 -5.353952 -0.958508
H  2.75891 -3.854011 -1.878641
H  4.506331 -1.038781 -1.100987
H  2.923993 -1.531649 -1.733224
H  3.044115 -0.178656 -0.595027
H  4.604029 -0.10177 2.300175
H  3.048333 0.350717 1.590575
H  3.110829 -0.310209 3.224548
H  4.512732 -3.13407 4.219071
H  3.00006 -2.240602 4.393258
H  2.979514 -4.010725 4.275733
H  -1.88258 -1.477825 2.173942
H  -2.832812 -3.891251 1.389661
H  -2.776925 -2.757871 -0.002995
H  -1.12328 -4.832965 -0.465853
H  -0.876413 -3.594267 3.39151
H  0.164297 -5.270543 1.737095
H  0.426652 -2.586574 2.838211
F  1.218988 -2.587258 -2.645342
elementType: C Rh F B H
totalener: -2251.86671065201062 hartree
nucrepener: 5744.65602006971676 hartree
electener: -7996.49621103422942 hartree
twoeener: 6588.13233778860013 hartree
cpcmener: -0.01933928825650 hartree
kineticenergy: 2172.47480284272024 hartree
exchangeener: -206.114573500204 hartree
energy: -679.6716 -679.5988 -679.5351 -679.5137 -679.5019 -679.4704 -679.1809 -679.1705 -679.0658 -676.9270 -284.3414 -284.2275 -284.1464 -284.1445 -284.1356 -284.0638 -284.0478 -284.0410 -283.7950 -282.8126 -282.5855 -282.5702 -282.5269 -282.4706 -282.3053 -282.1792 -282.1054 -282.0368 -282.0305 -281.6814 -281.6663 -281.5521 -281.4495 -281.4443 -281.4249 -281.3885 -281.1595 -281.1447 -281.0926 -187.0807 -91.7219 -57.4867 -56.9238 -56.6653 -36.2680 -36.1865 -35.9826 -35.8825 -35.8120 -35.6582 -35.4687 -35.4568 -35.3730 -32.8989 -26.5365 -26.2705 -25.5404 -25.4244 -23.2473 -23.1418 -23.0420 -22.3116 -22.1224 -22.0409 -21.7872 -21.2622 -21.0891 -21.0636 -20.9567 -20.5900 -19.1002 -18.7885 -18.7035 -18.6223 -18.5500 -18.3729 -17.2529 -16.9920 -16.9244 -16.6190 -16.5775 -16.4231 -16.2141 -15.9824 -15.4418 -15.4401 -15.4274 -15.4092 -15.3325 -15.2417 -14.9739 -14.9049 -14.8501 -14.5203 -14.4387 -14.2189 -14.1791 -14.0654 -14.0070 -13.9047 -13.7239 -13.6844 -13.5479 -13.4236 -13.4024 -13.3303 -13.0766 -12.8929 -12.8805 -12.7902 -12.7798 -12.7539 -12.6689 -12.5944 -12.5700 -12.4469 -12.2781 -12.0347 -11.9552 -11.8023 -11.7847 -11.7346 -11.6288 -11.5782 -11.4316 -11.4041 -11.3938 -11.2808 -11.1395 -11.0303 -10.9916 -10.9325 -10.6468 -10.5563 -10.3119 -10.2217 -10.1696 -10.1329 -10.0393 -9.8963 -9.8489 -9.1113 -8.8398 -8.7612 -8.5495 -8.2505 -7.9233 -7.7610 -7.6980 -7.2745 -7.1466 -7.0321 -6.7237 -6.1480 -2.2698 -1.0813 -0.9305 -0.2448 -0.0604 0.0335 0.0542 0.0953 0.1445 0.2317 0.3545 electronvolt
chargesum: -0.0000000
charge: 0.394316 0.511342 -0.276295 -0.686177 -0.014993 -0.148210 -0.267840 -0.037216 0.111047 1.208315 -0.133782 0.222331 0.226249 0.312157 -0.312779 -0.272824 -0.271524 -0.307615 0.876589 -0.252944 0.404060 0.335242 -0.015140 -0.000555 0.413395 -0.279268 -0.267995 -0.272293 -0.249736 -0.268988 -0.115735 -0.299975 -0.032981 -0.116021 0.080713 -0.177221 -0.139824 -0.085687 -0.138096 -0.140430 0.057946 0.037748 0.045726 0.042841 0.029682 0.049139 0.031185 0.031377 0.030550 0.047310 0.038658 0.032747 0.066978 0.042413 0.044296 0.059562 0.016929 0.034139 0.045960 0.081062 0.067978 0.031973 -0.479811
charge: -0.096405 -0.090885 0.061993 0.040488 -0.165759 -0.150136 -0.154210 -0.156654 -0.142365 0.615829 -0.369108 -0.378622 -0.376961 -0.382878 0.321093 0.352360 0.354473 0.339179 -1.131537 0.055240 -0.362577 -0.360235 -0.378599 -0.378524 -0.377877 0.335138 0.337862 0.352775 0.361297 0.351114 -0.045015 0.002463 0.150749 0.074483 0.024814 0.229079 0.235435 0.245544 0.255258 0.232340 -0.015135 -0.018166 -0.015564 -0.011933 -0.014497 -0.014761 -0.005201 -0.002121 -0.004518 -0.015883 -0.011365 -0.017236 -0.009871 -0.016191 -0.016353 -0.000380 -0.006434 0.004674 0.004067 0.009317 -0.031939 0.032608 0.346222
qa: 0.3943 0.5113 -0.2763 -0.6862 -0.0150 -0.1482 -0.2678 -0.0372 0.1110 1.2083 -0.1338 0.2223 0.2262 0.3122 -0.3128 -0.2728 -0.2715 -0.3076 0.8766 -0.2529 0.4041 0.3352 -0.0151 -0.0006 0.4134 -0.2793 -0.2680 -0.2723 -0.2497 -0.2690 -0.1157 -0.3000 -0.0330 -0.1160 0.0807 -0.1772 -0.1398 -0.0857 -0.1381 -0.1404 0.0579 0.0377 0.0457 0.0428 0.0297 0.0491 0.0312 0.0314 0.0306 0.0473 0.0387 0.0327 0.0670 0.0424 0.0443 0.0596 0.0169 0.0341 0.0460 0.0811 0.0680 0.0320 -0.4798
va: 2.3205 2.6046 2.6242 3.4754 3.2949 3.5598 3.4414 3.4085 2.9540 4.2849 3.4285 3.1938 3.4310 3.2957 0.8351 0.8671 0.8690 0.8340 2.1596 2.7223 3.0622 3.1217 3.7258 3.7199 3.3288 0.8477 0.7869 0.9066 0.8932 0.9003 3.8533 4.0912 3.6197 3.7858 3.5113 3.8202 3.7716 3.6999 3.8071 3.7899 1.0018 0.9921 0.9970 0.9945 0.9946 1.0286 0.9949 1.0133 0.9965 0.9989 1.0152 0.9986 0.9979 0.9971 0.9965 0.9968 1.0119 1.0284 1.0014 0.9999 1.0010 1.0484 0.4227
dispersion: -0.043549623 hartree
energy: -2251.910260275415 hartree
dipole: -31.886144665 34.570473129 2.684328464 26.771701473 -29.147868890 -2.376167417 -61.183141525 66.390952883 5.207811358
dipolemethod: SCF
magnitude: 6.322427544 au
magnitude: 16.070333685 debye
