program: Orca
programVersion: 6.0.1
elementType: C C C C C C C C C Rh C C C C F F F F B C C C C C C F F F F F C C C C C C C C C C H H H H H H H H H H H H H H H H H H H H H H F H H
elementType: Rh
charge: 0
multiplicity: 1
keywords: OPTTS FREQ r2scan-3c
frequency: 0.00 0.00 0.00 0.00 0.00 0.00 -229.78 25.19 26.96 28.85 32.15 46.23 65.64 87.88 95.06 112.57 115.70 119.14 125.79 134.65 138.33 146.95 153.07 157.96 160.34 161.74 165.69 167.61 169.25 176.16 180.12 190.30 194.98 203.86 210.62 214.60 237.74 244.35 278.76 278.92 284.56 286.69 287.20 297.72 299.53 300.46 303.66 311.96 319.48 325.08 346.58 355.49 366.97 379.08 380.17 386.49 391.40 411.22 415.19 435.36 453.35 460.82 484.34 492.67 508.63 513.97 533.19 539.15 545.07 555.91 582.56 591.18 597.77 604.53 607.57 619.25 629.74 639.90 641.10 652.05 658.73 665.46 681.43 696.47 729.18 744.64 757.63 766.91 794.85 799.63 800.70 808.71 820.38 846.98 854.94 870.91 897.96 916.61 926.89 947.34 951.04 955.14 962.44 977.63 987.05 991.44 1011.16 1032.99 1036.92 1038.13 1043.79 1050.74 1052.07 1059.59 1063.49 1085.40 1087.37 1110.35 1114.92 1120.16 1138.63 1143.84 1148.49 1154.07 1169.18 1170.19 1180.64 1187.83 1214.02 1253.72 1260.50 1281.21 1288.68 1299.64 1305.19 1316.91 1338.18 1338.68 1371.70 1378.17 1382.59 1391.00 1403.04 1404.79 1405.35 1413.94 1416.04 1423.24 1431.21 1441.66 1449.00 1455.98 1465.44 1467.60 1470.41 1474.21 1477.62 1480.49 1487.72 1489.95 1490.83 1492.27 1495.70 1496.96 1507.07 1508.24 1525.70 1532.47 1624.27 1638.88 1649.75 1662.60 2081.57 2981.08 3004.88 3006.04 3006.78 3007.27 3008.81 3021.07 3074.26 3083.72 3084.27 3085.26 3086.20 3087.71 3101.51 3109.60 3114.87 3119.15 3119.96 3121.10 3123.38 3127.50 3134.57
frequency: 25.19 26.96 28.85 32.15 46.23 65.64 87.88 95.06 112.57 115.70 119.14 125.79 134.65 138.33 146.95 153.07 157.96 160.34 161.74 165.69 167.61 169.25 176.16 180.12 190.30 194.98 203.86 210.62 214.60 237.74 244.35 278.76 278.92 284.56 286.69 287.20 297.72 299.53 300.46 303.66 311.96 319.48 325.08 346.58 355.49 366.97 379.08 380.17 386.49 391.40 411.22 415.19 435.36 453.35 460.82 484.34 492.67 508.63 513.97 533.19 539.15 545.07 555.91 582.56 591.18 597.77 604.53 607.57 619.25 629.74 639.90 641.10 652.05 658.73 665.46 681.43 696.47 729.18 744.64 757.63 766.91 794.85 799.63 800.70 808.71 820.38 846.98 854.94 870.91 897.96 916.61 926.89 947.34 951.04 955.14 962.44 977.63 987.05 991.44 1011.16 1032.99 1036.92 1038.13 1043.79 1050.74 1052.07 1059.59 1063.49 1085.40 1087.37 1110.35 1114.92 1120.16 1138.63 1143.84 1148.49 1154.07 1169.18 1170.19 1180.64 1187.83 1214.02 1253.72 1260.50 1281.21 1288.68 1299.64 1305.19 1316.91 1338.18 1338.68 1371.70 1378.17 1382.59 1391.00 1403.04 1404.79 1405.35 1413.94 1416.04 1423.24 1431.21 1441.66 1449.00 1455.98 1465.44 1467.60 1470.41 1474.21 1477.62 1480.49 1487.72 1489.95 1490.83 1492.27 1495.70 1496.96 1507.07 1508.24 1525.70 1532.47 1624.27 1638.88 1649.75 1662.60 2081.57 2981.08 3004.88 3006.04 3006.78 3007.27 3008.81 3021.07 3074.26 3083.72 3084.27 3085.26 3086.20 3087.71 3101.51 3109.60 3114.87 3119.15 3119.96 3121.10 3123.38 3127.50 3134.57
formula: C29H24BF10Rh
InChI: InChI=1/C19H8BF10.C10H15.Rh.H/c21-11-7-6-4-1-2-5(3-4)8(6)20(30,9(7)12(22)16(26)15(11)25)10-13(23)17(27)19(29)18(28)14(10)24;1-6-7(2)9(4)10(5)8(6)3;;/h2,4-5,30H,1,3H2;1-5H3;;/rC29H24BF10Rh/c1-23-24(2)26(4)27(5)25(23,3)41(23,24,26,27)10-7-8-6-9(10)29(41)28(8,41)11-12(15(32)19(36)18(35)14(11)31)30(29,40-42-41)13-16(33)20(37)22(39)21(38)17(13)34/h8-10,41H,6-7H2,1-5H3
65 atoms
C  -0.190023 -1.693598 0.767779
C  0.110863 -0.469302 0.01822
C  0.107697 -0.722995 -1.378033
C  -0.420237 -2.775801 -0.123828
C  3.490246 -4.141954 1.167555
C  3.226572 -3.238118 2.248033
C  3.661578 -3.3516 -0.042382
C  3.146282 -1.922314 1.714056
C  3.418949 -1.99378 0.289275
Rh 1.517152 -3.268899 0.686024
C  0.344423 0.807552 0.497118
C  0.422318 0.308069 -2.230734
C  0.680264 1.59623 -1.754351
C  0.627908 1.845768 -0.388545
F  0.305951 1.084975 1.817069
F  0.857795 3.080601 0.070657
F  0.958901 2.596985 -2.595982
F  0.461293 0.119719 -3.56155
B  -0.308724 -2.260077 -1.64119
C  -1.487017 -2.670961 -2.635288
C  -2.407812 -1.785015 -3.189946
C  -1.71201 -4.018529 -2.92002
C  -3.461339 -2.194659 -3.999609
C  -2.745239 -4.469043 -3.727857
C  -3.628328 -3.5450 -4.272718
F  -0.900266 -4.955516 -2.391638
F  -2.325556 -0.466443 -2.943811
F  -4.319139 -1.304712 -4.510423
F  -4.636086 -3.954431 -5.045747
F  -2.910237 -5.77343 -3.976616
C  -1.220568 -3.75072 0.740179
C  -1.019644 -1.90252 2.043928
C  -2.172098 -2.76639 1.453451
C  -0.307348 -2.981426 2.881369
C  -0.10089 -4.04314 1.795398
C  3.786319 -5.59817 1.318493
C  3.114219 -3.63419 3.683248
C  4.138682 -3.878064 -1.357111
C  3.54854 -0.82642 -0.631058
C  2.984592 -0.663701 2.4989
H  4.836777 -5.747641 1.601638
H  3.164327 -6.049363 2.09626
H  3.608946 -6.14326 0.388834
H  5.235498 -3.922363 -1.368054
H  3.763535 -4.887044 -1.545581
H  3.822413 -3.241762 -2.187054
H  4.575248 -0.437434 -0.620507
H  3.301458 -1.099312 -1.660224
H  2.883403 -0.010418 -0.338903
H  3.946443 -0.36889 2.939485
H  2.647536 0.161132 1.869542
H  2.265474 -0.775541 3.314737
H  4.095412 -3.932963 4.073457
H  2.752669 -2.810413 4.303088
H  2.435108 -4.482767 3.817381
H  -1.292585 -0.989119 2.574886
H  -2.805114 -3.215457 2.228312
H  -2.796974 -2.217667 0.7386
H  -1.647893 -4.620328 0.239755
H  -0.961092 -3.333184 3.694945
H  0.017403 -5.076779 2.122913
H  0.62258 -2.625077 3.330189
F  1.030197 -3.00811 -2.203837
H  1.13999 -4.587095 -0.07126
H  1.365321 -3.347284 -1.191768
totalener: -2253.17962408478525 hartree
nucrepener: 5793.46892837702399 hartree
electener: -8046.64855246180923 hartree
twoeener: 6635.90266520883779 hartree
kineticenergy: 2174.70911223486564 hartree
exchangeener: -275.472209230835 hartree
correlationener: -10.538689246896 hartree
xcener: -286.010898477731 hartree
dispersion: -0.041722529 hartree
dispersion: -0.041685945 hartree
dispersion: -0.041668799 hartree
dispersion: -0.041654684 hartree
dispersion: -0.041645852 hartree
dispersion: -0.041634539 hartree
dispersion: -0.041616639 hartree
dispersion: -0.041591750 hartree
dispersion: -0.041592076 hartree
dispersion: -0.041572555 hartree
dispersion: -0.041576733 hartree
dispersion: -0.041566926 hartree
dispersion: -0.041561258 hartree
dispersion: -0.041552446 hartree
dispersion: -0.041544211 hartree
dispersion: -0.041527659 hartree
dispersion: -0.041504670 hartree
dispersion: -0.041528659 hartree
dispersion: -0.041526591 hartree
dispersion: -0.041519724 hartree
dispersion: -0.041524919 hartree
dispersion: -0.041506988 hartree
dispersion: -0.041482144 hartree
dispersion: -0.041500984 hartree
dispersion: -0.041509784 hartree
dispersion: -0.041495534 hartree
dispersion: -0.041502560 hartree
dispersion: -0.041495261 hartree
dispersion: -0.041484541 hartree
dispersion: -0.041499427 hartree
dispersion: -0.041507733 hartree
dispersion: -0.041493579 hartree
dispersion: -0.041490920 hartree
dispersion: -0.041493712 hartree
dispersion: -0.041503135 hartree
dispersion: -0.041507691 hartree
dispersion: -0.041491554 hartree
dispersion: -0.041489686 hartree
dispersion: -0.041480381 hartree
dispersion: -0.041489369 hartree
dispersion: -0.041497216 hartree
dispersion: -0.041508308 hartree
dispersion: -0.041513875 hartree
dispersion: -0.041501148 hartree
dispersion: -0.041492287 hartree
dispersion: -0.041516998 hartree
dispersion: -0.041536890 hartree
dispersion: -0.041508271 hartree
dispersion: -0.041514469 hartree
dispersion: -0.041507047 hartree
dispersion: -0.041533529 hartree
dispersion: -0.041524904 hartree
dispersion: -0.041528744 hartree
dispersion: -0.041509162 hartree
dispersion: -0.041496974 hartree
dispersion: -0.041483521 hartree
dispersion: -0.041464660 hartree
dispersion: -0.041440647 hartree
dispersion: -0.041412712 hartree
dispersion: -0.041394910 hartree
dispersion: -0.041419058 hartree
dispersion: -0.041462656 hartree
dispersion: -0.041510027 hartree
dispersion: -0.041515545 hartree
dispersion: -0.041503256 hartree
dispersion: -0.041519189 hartree
dispersion: -0.041506390 hartree
dispersion: -0.041486836 hartree
dispersion: -0.041471801 hartree
dispersion: -0.041451212 hartree
dispersion: -0.041457787 hartree
dispersion: -0.041446023 hartree
dispersion: -0.041437685 hartree
dispersion: -0.041439622 hartree
dispersion: -0.041462307 hartree
dispersion: -0.041474521 hartree
dispersion: -0.041470031 hartree
dispersion: -0.041485100 hartree
dispersion: -0.041510984 hartree
dispersion: -0.041507979 hartree
dispersion: -0.041509947 hartree
dispersion: -0.041519584 hartree
dispersion: -0.041514173 hartree
dispersion: -0.041514819 hartree
dispersion: -0.041515607 hartree
dispersion: -0.041516871 hartree
dispersion: -0.041521944 hartree
dispersion: -0.041524457 hartree
dispersion: -0.041537124 hartree
dispersion: -0.041539404 hartree
dispersion: -0.041552856 hartree
dispersion: -0.041556929 hartree
dispersion: -0.041566979 hartree
dispersion: -0.041570386 hartree
dispersion: -0.041575300 hartree
dispersion: -0.041579809 hartree
dispersion: -0.041584738 hartree
dispersion: -0.041589524 hartree
dispersion: -0.041594559 hartree
dispersion: -0.041600712 hartree
dispersion: -0.041609097 hartree
dispersion: -0.041616980 hartree
dispersion: -0.041613529 hartree
dispersion: -0.041618296 hartree
dispersion: -0.041608098 hartree
dispersion: -0.041609206 hartree
dispersion: -0.041603354 hartree
dispersion: -0.041594652 hartree
dispersion: -0.041595644 hartree
dispersion: -0.041600450 hartree
dispersion: -0.041603249 hartree
dispersion: -0.041602094 hartree
dispersion: -0.041599057 hartree
dispersion: -0.041602027 hartree
dispersion: -0.041595409 hartree
dispersion: -0.041602412 hartree
energy: -667.3291 -667.3230 -667.2141 -667.1984 -667.1910 -667.1442 -666.9908 -666.9524 -666.9199 -666.8570 -276.0901 -276.0676 -275.9602 -275.8983 -275.8851 -275.8722 -275.8717 -275.8702 -275.7250 -274.2712 -274.2633 -274.2563 -274.1280 -274.1054 -274.0415 -273.9944 -273.6405 -273.6006 -273.5120 -273.4945 -273.4736 -273.4695 -273.4246 -273.4024 -273.3422 -273.2303 -273.1958 -273.1797 -273.1546 -180.8426 -87.6374 -54.2877 -53.8774 -53.5446 -33.2236 -33.2049 -32.9511 -32.9019 -32.7991 -32.6863 -32.5325 -32.4913 -32.4224 -31.8824 -24.0946 -23.7835 -23.3136 -23.1422 -21.0583 -21.0065 -20.9191 -20.2823 -20.0464 -20.0245 -19.4496 -19.2972 -19.2290 -19.0476 -18.7038 -18.3727 -17.2648 -16.9138 -16.8425 -16.7557 -16.7135 -16.6033 -15.4761 -15.1852 -15.1486 -14.8437 -14.7914 -14.5976 -14.4387 -14.2834 -14.1397 -13.8933 -13.8506 -13.8379 -13.7711 -13.6792 -13.5289 -13.2620 -13.0797 -13.0565 -12.8268 -12.7456 -12.5554 -12.4336 -12.2511 -12.2163 -12.1599 -12.0063 -11.9300 -11.7200 -11.4979 -11.4635 -11.4342 -11.4063 -11.3740 -11.3356 -11.2622 -11.2039 -11.1935 -11.1029 -10.7303 -10.7035 -10.6948 -10.6420 -10.6043 -10.5691 -10.4973 -10.4609 -10.4188 -10.2568 -10.1337 -10.1063 -10.0072 -9.9541 -9.8297 -9.5713 -9.4089 -9.3445 -9.2760 -9.2191 -9.0874 -9.0339 -9.0175 -9.0154 -8.7250 -8.6276 -8.5428 -8.4549 -8.2613 -8.1178 -7.7326 -7.3704 -7.1777 -6.9719 -6.5648 -6.4241 -6.3681 -6.3007 -6.1581 -5.6236 -5.3581 -2.7121 -1.8776 -1.4514 -1.1001 -0.8595 -0.8189 -0.5850 -0.3326 -0.0843 0.0886 0.1693 electronvolt
chargesum: 0.0000000
charge: -0.218507 0.031938 0.093479 0.087608 0.263461 0.045174 0.159914 0.123745 0.269961 -0.972651 0.027165 0.189320 0.125752 0.126886 -0.203403 -0.179303 -0.175462 -0.199124 0.522654 -0.054320 0.283857 0.220031 0.069154 0.067303 0.176025 -0.204180 -0.201489 -0.179654 -0.180187 -0.180420 0.074872 0.177947 -0.545682 -0.356991 -0.170351 -0.534154 -0.642452 -0.541804 -0.662277 -0.591280 0.170328 0.155145 0.157582 0.167596 0.164707 0.165656 0.165732 0.172387 0.168347 0.169326 0.166859 0.156844 0.169479 0.159565 0.179989 0.176384 0.157581 0.169510 0.178645 0.164898 0.168828 0.163283 -0.376704 0.183059 0.382422
charge: -0.008939 -0.020582 -0.087330 -0.108958 -0.066679 -0.068659 -0.061844 -0.052383 -0.066182 -0.565526 0.207606 0.232868 0.228861 0.226758 -0.265401 -0.242189 -0.241015 -0.249477 0.122715 -0.103687 0.246221 0.241416 0.223222 0.222130 0.237580 -0.253352 -0.246682 -0.242718 -0.236606 -0.244546 -0.148229 -0.161363 -0.239824 -0.244097 -0.166753 -0.363964 -0.373490 -0.371731 -0.363082 -0.367558 0.167200 0.170322 0.169985 0.168901 0.171277 0.172225 0.168703 0.175625 0.176907 0.170454 0.176275 0.169089 0.170522 0.167770 0.173306 0.173977 0.162721 0.172557 0.176981 0.162323 0.170616 0.171530 -0.279028 0.191278 0.371953
qa: -0.2185 0.0319 0.0935 0.0876 0.2635 0.0452 0.1599 0.1237 0.2700 -0.9727 0.0272 0.1893 0.1258 0.1269 -0.2034 -0.1793 -0.1755 -0.1991 0.5227 -0.0543 0.2839 0.2200 0.0692 0.0673 0.1760 -0.2042 -0.2015 -0.1797 -0.1802 -0.1804 0.0749 0.1779 -0.5457 -0.3570 -0.1704 -0.5342 -0.6425 -0.5418 -0.6623 -0.5913 0.1703 0.1551 0.1576 0.1676 0.1647 0.1657 0.1657 0.1724 0.1683 0.1693 0.1669 0.1568 0.1695 0.1596 0.1800 0.1764 0.1576 0.1695 0.1786 0.1649 0.1688 0.1633 -0.3767 0.1831 0.3824
va: 3.5267 3.5526 3.3168 3.0412 3.5076 3.6793 3.5610 3.4608 3.4159 4.8096 3.4816 3.5501 3.5897 3.6660 0.9972 1.0315 1.0352 1.0079 3.4486 3.4611 3.5204 3.6323 3.6697 3.6809 3.6382 1.0076 1.0124 1.0299 1.0387 1.0297 3.7857 3.3234 3.8387 3.6570 3.7736 3.7674 3.7149 3.6931 3.6842 3.7357 0.9556 0.9623 0.9633 0.9549 0.9598 0.9623 0.9556 0.9566 0.9624 0.9544 0.9624 0.9595 0.9551 0.9625 0.9506 0.9616 0.9627 0.9577 0.9595 0.9591 0.9632 0.9677 0.9166 0.9814 0.8850
dispersion: -0.041601574 hartree
energy: -2253.184756733552 hartree
dipole: -30.229801213 32.395468798 2.165667585 44.185314705 -45.401818569 -1.216503865 -27.490050796 29.926798594 2.436747799
dipolemethod: SCF
magnitude: 3.479617447 au
magnitude: 8.844484667 debye
temp: 298.15 k
press: 1.00 atm
zeropoint: 0.45970796 hartree
thermalvibcorrection: 0.03556464 hartree
thermalrotcorrection: 0.00141627 hartree
thermaltrasncorrection: 0.00141627 hartree
thermaltotal: -2252.68665159 hartree
thermalcorr: 0.03839718 hartree
nonthermalcorr: 0.45970796 hartree
totalcorr: 0.49810514 hartree
thermalcorrenthalpy: 0.00094421 hartree
totalenthalpy: -2252.68570738 hartree
vibrat: 0.06265850 hartree
rotat: 0.01795853 hartree
transl: 0.02157821 hartree
total: 0.10219524 hartree
totalentropycorr: -0.10219524 hartree
gibbsenthalpy: -2252.78790262 hartree
gibbsminuselec: 0.39685411 hartree
