program: Orca
programVersion: 6.0.1
elementType: C C C C C C C C C Rh C C C C F F F F B C C C C C C F F F F F C C C C C C C C C C H H H H H H H H H H H H H H H H H H H H H H F H H
elementType: Rh
charge: 0
multiplicity: 1
keywords: r2scan0 d4 ma-def2-qzvp SP TIGHTSCF AIM NBO SMD(toluene)
formula: C29H24BF10Rh
InChI: InChI=1/C19H7BF9.C10H15.FH.Rh.H/c21-11-7-6-4-1-2-5(3-4)8(6)20(9(7)12(22)16(26)15(11)25)10-13(23)17(27)19(29)18(28)14(10)24;1-6-7(2)9(4)10(5)8(6)3;;;/h2,4-5H,1,3H2;1-5H3;1H;;/rC29H23BF9Rh.FH/c1-8-24(2)26(4)27(5)25(8,3)40(24,26,27)11-7-9-6-10(11)29(40)28(9,40)12-13(16(32)20(36)19(35)15(12)31)30(29)14-17(33)21(37)23(39)22(38)18(14)34;/h9-11,40H,6-7H2,1-5H3;1H
65 atoms
C  -0.229634 -1.697828 0.983655
C  0.019233 -0.433993 0.26889
C  -0.140827 -0.615308 -1.135546
C  -0.578172 -2.727121 0.036078
C  3.339829 -4.153716 1.102334
C  3.186811 -3.168109 2.131014
C  3.514531 -3.454959 -0.162632
C  3.168828 -1.886867 1.505792
C  3.374752 -2.066263 0.084111
Rh 1.39608 -3.207664 0.716875
C  0.347383 0.805278 0.774007
C  0.155203 0.436419 -1.976578
C  0.526542 1.685588 -1.467789
C  0.602355 1.870967 -0.094737
F  0.433276 1.031319 2.099816
F  0.938681 3.06715 0.394176
F  0.798621 2.705645 -2.287843
F  0.089317 0.312064 -3.308193
B  -0.713131 -2.06766 -1.357513
C  -1.569478 -2.602854 -2.54457
C  -2.404675 -1.788252 -3.312872
C  -1.597917 -3.965309 -2.857458
C  -3.18681 -2.275348 -4.350674
C  -2.35105 -4.48562 -3.898283
C  -3.153484 -3.632193 -4.647127
F  -0.855358 -4.830476 -2.152179
F  -2.512594 -0.480829 -3.036986
F  -3.978478 -1.462811 -5.056623
F  -3.899092 -4.117234 -5.638559
F  -2.327926 -5.791635 -4.181364
C  -1.312358 -3.732107 0.921585
C  -1.020238 -1.939486 2.283924
C  -2.21217 -2.767968 1.725152
C  -0.280255 -3.053397 3.043711
C  -0.124572 -4.056113 1.895829
C  3.560387 -5.613066 1.332948
C  3.173431 -3.45554 3.595625
C  3.974484 -4.108633 -1.425999
C  3.521595 -0.957366 -0.904466
C  3.164748 -0.569722 2.204224
H  4.613324 -5.808825 1.576496
H  2.953063 -5.978311 2.165738
H  3.304708 -6.201052 0.448593
H  5.041554 -4.351448 -1.334481
H  3.441019 -5.041568 -1.626055
H  3.847615 -3.460481 -2.293958
H  4.529209 -0.523551 -0.857413
H  3.343848 -1.303137 -1.925065
H  2.808468 -0.151855 -0.704879
H  4.187875 -0.312585 2.510748
H  2.81476 0.231855 1.550878
H  2.538936 -0.573534 3.09983
H  4.1814 -3.726179 3.936007
H  2.854078 -2.587371 4.177281
H  2.509456 -4.290982 3.839499
H  -1.253957 -1.040465 2.857074
H  -2.804914 -3.240603 2.517665
H  -2.871535 -2.188204 1.068159
H  -1.775389 -4.586635 0.427008
H  -0.899317 -3.44189 3.867945
H  0.02639 -5.103416 2.161267
H  0.669462 -2.716749 3.463743
F  1.389658 -2.998915 -2.573482
H  0.986624 -4.49311 -0.073193
H  1.465131 -3.231388 -1.65427
elementType: C Rh F B H
totalener: -2253.02025872455670 hartree
nucrepener: 5763.60933682220366 hartree
electener: -8016.61020625616402 hartree
twoeener: 6605.76694262613455 hartree
cpcmener: -0.01196311550354 hartree
kineticenergy: 2173.44774065820593 hartree
exchangeener: -206.571097038596 hartree
energy: -680.0260 -679.8951 -679.8329 -679.8222 -679.7384 -679.6402 -679.6260 -679.5944 -679.4943 -678.1082 -284.8212 -284.6332 -284.6206 -284.5971 -284.5160 -284.5143 -284.4108 -284.3748 -284.2888 -282.4195 -282.2292 -282.2180 -282.1481 -282.1001 -282.0322 -281.9991 -281.9911 -281.6231 -281.6011 -281.4410 -281.4312 -281.3360 -281.2847 -281.2663 -281.2604 -281.2212 -281.1757 -281.1531 -281.0863 -187.5258 -91.4247 -57.0185 -56.7264 -56.3592 -36.6453 -36.4862 -36.3540 -36.2226 -36.1635 -35.9479 -35.9074 -35.8752 -35.7818 -34.1471 -26.1787 -26.0133 -25.9627 -25.4583 -23.3055 -22.8013 -22.7677 -22.7498 -22.5650 -22.3676 -21.4341 -20.9718 -20.9285 -20.7101 -20.6332 -20.1970 -19.5594 -19.1997 -19.0711 -18.7425 -18.2576 -18.1002 -17.3994 -17.2316 -17.1331 -17.0132 -16.8768 -16.5895 -16.2364 -15.9254 -15.8374 -15.7350 -15.6060 -15.5603 -15.3418 -15.1789 -15.1701 -15.1279 -15.0976 -14.9433 -14.7982 -14.5968 -14.3929 -14.3092 -14.2686 -13.9922 -13.8497 -13.8017 -13.7615 -13.6094 -13.5941 -13.4700 -13.3684 -13.1519 -13.1110 -13.0094 -12.8638 -12.6193 -12.5344 -12.4682 -12.3799 -12.3422 -12.2140 -12.1981 -12.1648 -12.0142 -11.8416 -11.6390 -11.6125 -11.5543 -11.4679 -11.4296 -11.3469 -11.2093 -11.1780 -11.0481 -10.9465 -10.8017 -10.7187 -10.6009 -10.4196 -10.3180 -10.2374 -10.0069 -9.9633 -9.9414 -9.7023 -9.5462 -9.3587 -9.0854 -8.8577 -8.4522 -8.2015 -7.9207 -7.5909 -7.5678 -7.5208 -7.5024 -7.2175 -6.3203 -5.9672 -2.4950 -1.3447 -0.5734 -0.4144 -0.2540 -0.2040 -0.0745 0.0270 0.1789 0.2823 0.4230 electronvolt
chargesum: -0.0000000
charge: -0.430914 0.417076 0.134973 -0.104496 -0.242916 -0.028571 -0.200937 -0.143061 0.004322 1.882924 -0.156433 0.105833 0.229283 0.316422 -0.301045 -0.256672 -0.267175 -0.264845 0.242919 -0.098545 0.332286 0.362762 -0.004550 0.017605 0.473013 -0.240236 -0.260033 -0.264957 -0.234118 -0.270809 -0.328491 -0.046419 -0.052564 -0.075596 -0.161257 -0.141276 -0.211286 -0.149825 -0.122630 -0.175160 0.052308 0.033514 0.041324 0.048732 0.062929 0.054648 0.038792 0.042088 0.009219 0.050073 0.034443 0.044418 0.051705 0.042020 0.049739 0.035312 0.011749 0.008567 0.043157 0.005457 0.050179 0.011752 -0.323569 -0.113166 0.330012
charge: -0.090646 -0.073161 0.058352 -0.076446 -0.193482 -0.179190 -0.168318 -0.146162 -0.155243 0.631143 -0.380344 -0.369112 -0.375486 -0.377657 0.322511 0.367824 0.361504 0.356066 -0.477228 0.052051 -0.348031 -0.353483 -0.371137 -0.371754 -0.366467 0.343990 0.358428 0.364672 0.377643 0.363607 -0.043092 -0.019131 0.138907 0.065376 -0.013243 0.218404 0.219074 0.224306 0.230322 0.235097 -0.016870 -0.016648 -0.017708 -0.014066 -0.015564 -0.019004 -0.014380 -0.009630 -0.008473 -0.010450 -0.009755 -0.010002 -0.014423 -0.019188 -0.013515 -0.004726 -0.013322 -0.002532 -0.004179 -0.009298 -0.043532 -0.011099 0.432989 -0.021037 -0.454055
qa: -0.4309 0.4171 0.1350 -0.1045 -0.2429 -0.0286 -0.2009 -0.1431 0.0043 1.8829 -0.1564 0.1058 0.2293 0.3164 -0.3010 -0.2567 -0.2672 -0.2648 0.2429 -0.0985 0.3323 0.3628 -0.0045 0.0176 0.4730 -0.2402 -0.2600 -0.2650 -0.2341 -0.2708 -0.3285 -0.0464 -0.0526 -0.0756 -0.1613 -0.1413 -0.2113 -0.1498 -0.1226 -0.1752 0.0523 0.0335 0.0413 0.0487 0.0629 0.0546 0.0388 0.0421 0.0092 0.0501 0.0344 0.0444 0.0517 0.0420 0.0497 0.0353 0.0117 0.0086 0.0432 0.0055 0.0502 0.0118 -0.3236 -0.1132 0.3300
va: 3.5775 2.6679 2.7898 2.8993 3.3921 3.3558 3.5962 3.2688 3.1835 2.3482 3.3931 3.3534 3.4466 3.3931 0.8439 0.8929 0.8941 0.8564 2.7478 3.0321 3.1820 3.2810 3.7130 3.6752 3.3156 0.8350 0.8698 0.9284 0.9216 0.9341 3.9727 3.6567 3.6840 3.8071 3.7570 3.7067 3.7752 3.6663 3.7457 3.7283 0.9988 0.9891 0.9930 0.9988 0.9797 0.9924 0.9989 0.9992 1.0324 1.0012 1.0107 0.9873 0.9981 0.9888 0.9835 0.9935 1.0023 1.0196 0.9854 1.0072 0.9577 1.0165 0.8152 1.1396 0.9988
dispersion: -0.044199973 hartree
energy: -2253.064458697762 hartree
dipole: -23.414910072 25.151263377 1.736353306 40.416110528 -41.596065762 -1.179955234 -30.014620963 32.601524665 2.586903702
dipolemethod: SCF
magnitude: 3.331559383 au
magnitude: 8.468150976 debye
