program: Orca
programVersion: 6.0.1
elementType: C C C C C C C C C Rh C C C C F F F F B C C C C C C F F F F F C C C C C C C C C C H H H H H H H H H H H H H H H H H H H H H H H
elementType: Rh
charge: 0
multiplicity: 1
keywords: r2scan0 d4 ma-def2-qzvp SP TIGHTSCF AIM NBO SMD(toluene)
formula: C29H23BF9Rh
InChI: InChI=1/C19H8BF9.C10H15.Rh/c21-11-7-6-4-1-2-5(3-4)8(6)20(9(7)12(22)16(26)15(11)25)10-13(23)17(27)19(29)18(28)14(10)24;1-6-7(2)9(4)10(5)8(6)3;/h4-5H,1-3H2;1-5H3;/rC29H23BF9Rh/c1-23-24(2)26(4)27(5)25(23,3)40(23,24,26,27)28-9-6-7-10(8-9)29(28,40)30(12-11(28)14(31)18(35)19(36)15(12)32)13-16(33)20(37)22(39)21(38)17(13)34/h9-10H,6-8H2,1-5H3
63 atoms
C  -0.343717 -1.81817 1.479283
C  -0.125091 -0.437063 1.025137
C  -0.199596 -0.364392 -0.403346
C  -0.757756 -2.614411 0.331781
C  3.233122 -4.041069 1.151186
C  3.311056 -2.692649 1.611965
C  3.0311 -4.06169 -0.287942
C  3.023455 -1.858256 0.475771
C  2.882061 -2.71714 -0.706685
Rh 1.279646 -3.075671 0.778942
C  0.185237 0.68602 1.758107
C  0.101563 0.837756 -1.00986
C  0.387509 1.985411 -0.263596
C  0.422663 1.906803 1.12034
F  0.301168 0.637149 3.103516
F  0.713054 2.996336 1.840628
F  0.6435 3.152836 -0.87094
F  0.149504 0.957689 -2.351537
B  -0.623601 -1.795072 -0.930737
C  -0.969831 -2.230625 -2.39551
C  -1.735436 -1.43057 -3.246808
C  -0.597789 -3.470254 -2.916852
C  -2.068502 -1.802457 -4.5421
C  -0.892307 -3.870372 -4.212006
C  -1.636408 -3.02964 -5.030174
F  0.104263 -4.337555 -2.161486
F  -2.227513 -0.264783 -2.802822
F  -2.814041 -1.008095 -5.31637
F  -1.948338 -3.405792 -6.271527
F  -0.480672 -5.057543 -4.675652
C  -1.596895 -3.722999 0.937588
C  -1.149171 -2.325977 2.685623
C  -2.40696 -2.882507 1.957886
C  -0.52764 -3.65246 3.164936
C  -0.657024 -4.537849 1.890186
C  3.398967 -5.259582 1.995802
C  3.659532 -2.220262 2.983956
C  3.050239 -5.281964 -1.146788
C  2.759559 -2.217885 -2.105836
C  3.148161 -0.377547 0.449319
H  4.455327 -5.55702 2.029165
H  3.071022 -5.084545 3.024045
H  2.834138 -6.105608 1.594513
H  4.079056 -5.638926 -1.292072
H  2.479135 -6.102485 -0.701909
H  2.620873 -5.082092 -2.130059
H  3.756663 -1.99214 -2.508731
H  2.294699 -2.959758 -2.758852
H  2.166267 -1.30145 -2.158063
H  4.199299 -0.104647 0.28216
H  2.556649 0.066992 -0.352701
H  2.834815 0.069717 1.395523
H  4.731231 -1.990502 3.059029
H  3.104805 -1.314799 3.245358
H  3.43285 -2.978342 3.738411
H  -1.319247 -1.593884 3.477615
H  -3.052396 -3.480291 2.615896
H  -2.998473 -2.10388 1.466011
H  -2.162133 -4.337349 0.233731
H  -1.117425 -4.069805 3.990113
H  -1.055045 -5.535291 2.109019
H  0.505397 -3.533899 3.503424
H  0.326583 -4.772713 1.397579
elementType: C Rh F B H
totalener: -2152.59316774307854 hartree
nucrepener: 5477.34166343162451 hartree
electener: -7629.91419627793675 hartree
twoeener: 6281.10208744113061 hartree
cpcmener: -0.01240766537802 hartree
kineticenergy: 2073.59991943530395 hartree
exchangeener: -198.782238168031 hartree
energy: -679.9227 -679.7989 -679.7400 -679.6156 -679.5465 -679.4736 -679.4706 -679.2982 -679.2390 -284.6614 -284.4525 -284.4339 -284.4312 -284.4114 -284.2674 -284.0397 -284.0102 -283.8739 -282.4248 -282.4126 -282.3815 -282.0629 -282.0526 -282.0068 -281.8652 -281.7265 -281.5582 -281.4632 -281.4398 -281.3754 -281.3141 -281.2932 -281.2847 -281.2662 -281.2220 -281.2026 -281.1033 -280.6377 -186.7199 -90.8950 -56.7133 -56.1439 -55.7805 -36.5392 -36.2621 -36.1811 -36.1025 -35.8669 -35.8120 -35.7839 -35.5560 -35.4762 -26.1742 -25.8624 -25.7439 -25.1996 -23.0488 -22.9037 -22.8492 -22.6286 -22.4454 -22.0347 -21.2674 -21.0501 -21.0077 -20.8315 -20.7841 -20.1704 -19.4065 -19.0803 -18.7903 -18.4771 -18.4025 -18.1794 -17.2755 -17.1355 -16.9424 -16.9163 -16.7289 -16.4829 -16.1445 -15.8144 -15.7349 -15.6239 -15.2962 -15.2683 -15.2356 -15.2068 -15.0534 -14.8773 -14.8054 -14.6703 -14.5042 -14.2531 -14.2028 -14.0464 -13.8301 -13.7318 -13.7071 -13.6606 -13.5496 -13.4004 -13.3789 -13.3585 -13.0719 -12.9891 -12.7604 -12.7131 -12.5909 -12.5836 -12.5345 -12.4368 -12.3176 -12.2446 -12.0806 -11.9424 -11.7387 -11.7120 -11.5644 -11.5119 -11.3739 -11.3096 -11.2335 -11.1548 -10.9923 -10.9854 -10.6931 -10.5425 -10.4246 -10.3668 -10.2244 -10.1355 -10.0318 -10.0139 -9.9306 -9.5718 -9.5369 -9.3643 -8.9011 -8.5382 -8.3256 -8.0015 -7.8593 -7.5250 -7.4378 -7.4283 -7.0883 -6.9222 -6.1269 -5.3305 -2.0113 -1.7848 -0.5881 -0.2833 -0.1787 -0.0739 0.0344 0.1620 0.2654 0.4108 0.5679 electronvolt
chargesum: -0.0000000
charge: 0.020328 0.247474 0.090594 0.011313 -0.039106 -0.260808 -0.031363 0.165007 -0.021762 0.952648 -0.146950 0.144893 0.141694 0.333267 -0.306159 -0.272136 -0.285176 -0.269370 -0.164341 -0.084215 0.327194 0.366325 0.062923 -0.058897 0.428174 -0.229468 -0.267675 -0.261507 -0.243767 -0.274160 -0.026013 -0.086208 -0.050426 -0.052866 0.018203 -0.156530 -0.125787 -0.181320 -0.090761 -0.129698 0.061512 0.040497 0.039113 0.043466 0.029534 0.043061 0.033322 0.033559 0.053879 0.035339 0.038580 0.053591 0.047092 0.049394 0.031017 0.036824 0.010075 0.012340 0.049844 0.012612 0.025322 0.024381 0.002076
charge: -0.138911 -0.081388 0.045116 -0.087317 -0.169346 -0.171589 -0.156379 -0.161871 -0.148398 0.556702 -0.378005 -0.380784 -0.386261 -0.383663 0.317295 0.357135 0.347955 0.328201 -0.517120 0.044750 -0.355173 -0.363927 -0.374035 -0.377794 -0.372322 0.318566 0.355789 0.362455 0.370231 0.355664 -0.020223 -0.028937 0.138191 0.104727 0.131770 0.228694 0.225491 0.226091 0.244483 0.243075 -0.012394 -0.015961 -0.015297 -0.018080 -0.016057 -0.016238 -0.009686 -0.009107 -0.002015 -0.006007 -0.005618 -0.004956 -0.017678 -0.012517 -0.019388 -0.005787 -0.011190 -0.002744 -0.004243 -0.014598 -0.009457 -0.013577 -0.006342
qa: 0.0203 0.2475 0.0906 0.0113 -0.0391 -0.2608 -0.0314 0.1650 -0.0218 0.9526 -0.1469 0.1449 0.1417 0.3333 -0.3062 -0.2721 -0.2852 -0.2694 -0.1643 -0.0842 0.3272 0.3663 0.0629 -0.0589 0.4282 -0.2295 -0.2677 -0.2615 -0.2438 -0.2742 -0.0260 -0.0862 -0.0504 -0.0529 0.0182 -0.1565 -0.1258 -0.1813 -0.0908 -0.1297 0.0615 0.0405 0.0391 0.0435 0.0295 0.0431 0.0333 0.0336 0.0539 0.0353 0.0386 0.0536 0.0471 0.0494 0.0310 0.0368 0.0101 0.0123 0.0498 0.0126 0.0253 0.0244 0.0021
va: 2.8396 2.7807 2.7582 2.5485 3.5396 3.3574 3.3751 2.9985 3.1909 3.6436 3.3909 3.3065 3.4180 3.3625 0.8509 0.8851 0.8800 0.8172 3.2806 3.2503 3.1555 3.3422 3.5829 3.8290 3.3540 0.7775 0.8713 0.9178 0.9102 0.9255 3.6505 3.7202 3.6730 3.7953 3.6557 3.8054 3.7395 3.7773 3.6556 3.6691 0.9979 0.9966 0.9964 0.9970 0.9982 1.0012 0.9953 0.9941 0.9843 0.9968 0.9981 0.9800 1.0003 0.9917 0.9952 0.9979 1.0051 1.0241 1.0027 1.0060 1.0030 0.9994 1.0579
dispersion: -0.043135965 hartree
energy: -2152.636303708364 hartree
dipole: -21.296783761 23.328904400 2.032120639 32.688953194 -35.540617366 -2.851664171 -33.316537800 35.081695375 1.765157574
dipolemethod: SCF
magnitude: 3.921388032 au
magnitude: 9.967376257 debye
