program: Orca
programVersion: 6.0.1
elementType: C C C C C C C C C Rh C C C C F F F F B C C C C C C F F F F F C C C C C C C C C C H H H H H H H H H H H H H H H H H H H H H H F H H
elementType: Rh
charge: 0
multiplicity: 1
keywords: OPT FREQ r2scan-3c
frequency: 0.00 0.00 0.00 0.00 0.00 0.00 19.63 27.28 29.11 33.18 41.35 57.39 79.60 85.55 99.76 107.81 108.52 122.70 123.73 131.93 135.71 137.08 147.15 150.79 157.24 162.20 166.81 167.50 175.16 176.42 180.20 188.01 206.23 208.72 217.66 221.08 238.89 256.64 270.70 279.89 280.88 286.86 287.29 291.07 299.77 305.84 309.26 311.59 315.36 320.73 332.46 341.19 352.49 380.17 388.49 390.30 396.56 421.05 424.16 439.62 447.39 453.44 471.15 490.39 498.95 514.80 528.60 540.55 553.89 566.20 584.24 587.59 607.65 620.82 622.65 630.01 638.90 647.68 652.38 671.86 689.06 707.01 728.54 750.89 771.23 784.50 798.33 799.20 802.90 818.96 826.42 844.51 879.29 884.63 887.95 921.62 937.83 948.95 952.76 955.92 957.92 979.29 984.73 987.58 1015.46 1022.32 1035.02 1037.71 1039.60 1041.77 1045.80 1049.70 1050.07 1081.20 1088.49 1092.44 1109.53 1120.42 1122.71 1131.39 1137.91 1152.66 1157.51 1164.92 1172.25 1184.85 1207.18 1224.28 1230.50 1266.99 1288.83 1296.66 1300.36 1306.03 1312.91 1326.90 1339.50 1345.86 1363.86 1374.09 1387.57 1396.40 1402.07 1406.98 1408.82 1411.81 1416.87 1427.90 1441.76 1454.57 1461.52 1465.45 1468.72 1474.56 1477.51 1479.15 1480.62 1484.06 1485.62 1488.46 1493.00 1498.56 1502.56 1504.64 1528.30 1529.47 1550.06 1615.30 1638.85 1652.77 1658.09 2540.04 2701.13 3001.12 3006.55 3007.56 3007.98 3009.26 3025.54 3029.12 3059.24 3075.74 3081.92 3086.20 3086.72 3089.36 3091.03 3096.02 3109.44 3118.81 3119.13 3122.62 3123.86 3127.95 3130.79
frequency: 19.63 27.28 29.11 33.18 41.35 57.39 79.60 85.55 99.76 107.81 108.52 122.70 123.73 131.93 135.71 137.08 147.15 150.79 157.24 162.20 166.81 167.50 175.16 176.42 180.20 188.01 206.23 208.72 217.66 221.08 238.89 256.64 270.70 279.89 280.88 286.86 287.29 291.07 299.77 305.84 309.26 311.59 315.36 320.73 332.46 341.19 352.49 380.17 388.49 390.30 396.56 421.05 424.16 439.62 447.39 453.44 471.15 490.39 498.95 514.80 528.60 540.55 553.89 566.20 584.24 587.59 607.65 620.82 622.65 630.01 638.90 647.68 652.38 671.86 689.06 707.01 728.54 750.89 771.23 784.50 798.33 799.20 802.90 818.96 826.42 844.51 879.29 884.63 887.95 921.62 937.83 948.95 952.76 955.92 957.92 979.29 984.73 987.58 1015.46 1022.32 1035.02 1037.71 1039.60 1041.77 1045.80 1049.70 1050.07 1081.20 1088.49 1092.44 1109.53 1120.42 1122.71 1131.39 1137.91 1152.66 1157.51 1164.92 1172.25 1184.85 1207.18 1224.28 1230.50 1266.99 1288.83 1296.66 1300.36 1306.03 1312.91 1326.90 1339.50 1345.86 1363.86 1374.09 1387.57 1396.40 1402.07 1406.98 1408.82 1411.81 1416.87 1427.90 1441.76 1454.57 1461.52 1465.45 1468.72 1474.56 1477.51 1479.15 1480.62 1484.06 1485.62 1488.46 1493.00 1498.56 1502.56 1504.64 1528.30 1529.47 1550.06 1615.30 1638.85 1652.77 1658.09 2540.04 2701.13 3001.12 3006.55 3007.56 3007.98 3009.26 3025.54 3029.12 3059.24 3075.74 3081.92 3086.20 3086.72 3089.36 3091.03 3096.02 3109.44 3118.81 3119.13 3122.62 3123.86 3127.95 3130.79
formula: C29H24BF10Rh
InChI: InChI=1/C19H9BF10.C10H15.Rh/c21-11-7-6-4-1-2-5(3-4)8(6)20(30,9(7)12(22)16(26)15(11)25)10-13(23)17(27)19(29)18(28)14(10)24;1-6-7(2)9(4)10(5)8(6)3;/h4-5,8H,1-3H2;1-5H3;/rC29H24BF10Rh/c1-23-24(2)26(4)27(5)25(23,3)41(23,24,26,27)28-9-6-7-10(8-9)29(28,41)30(40,12-11(28)14(31)18(35)19(36)15(12)32)13-16(33)20(37)22(39)21(38)17(13)34/h9-10,29H,6-8H2,1-5H3
65 atoms
C  0.072377 -1.939357 0.719944
C  0.160815 -0.617922 0.088062
C  0.143605 -0.687975 -1.316855
C  -0.103482 -3.024239 -0.345019
C  3.80201 -4.016476 1.45871
C  3.538059 -2.887833 2.348178
C  3.740062 -3.528532 0.143282
C  3.463241 -1.676753 1.579222
C  3.496694 -2.072678 0.197935
Rh 1.785603 -2.987075 1.085269
C  0.30117 0.602759 0.735097
C  0.318926 0.479718 -2.030553
C  0.477195 1.707123 -1.393937
C  0.464364 1.767075 -0.001083
F  0.30866 0.682951 2.086396
F  0.615409 2.948318 0.613355
F  0.622892 2.839689 -2.092945
F  0.305325 0.472158 -3.375833
B  -0.052077 -2.218817 -1.833718
C  -1.411414 -2.549313 -2.67188
C  -2.480911 -1.684935 -2.877383
C  -1.567691 -3.818311 -3.227134
C  -3.611157 -2.026955 -3.61267
C  -2.675676 -4.205224 -3.967149
C  -3.707292 -3.295983 -4.164216
F  -0.61999 -4.758241 -3.025747
F  -2.476113 -0.442547 -2.35172
F  -4.607485 -1.149152 -3.791261
F  -4.786664 -3.644702 -4.87168
F  -2.77365 -5.440811 -4.477726
C  -1.317399 -3.838186 0.179038
C  -0.943346 -2.292328 1.796637
C  -2.125609 -2.748348 0.912866
C  -0.462864 -3.644185 2.414254
C  -0.876366 -4.712222 1.362754
C  4.050062 -5.41845 1.905798
C  3.510879 -2.974226 3.835758
C  3.901267 -4.284226 -1.129807
C  3.514792 -1.162916 -0.976512
C  3.420833 -0.28264 2.099782
H  5.060094 -5.521737 2.32234
H  3.345149 -5.727527 2.683724
H  3.958033 -6.122602 1.076236
H  4.916645 -4.139514 -1.522264
H  3.741814 -5.355573 -0.989345
H  3.198233 -3.926293 -1.887826
H  4.554721 -0.989813 -1.286909
H  2.967276 -1.586984 -1.822074
H  3.067254 -0.195794 -0.73569
H  4.440416 0.108952 2.212731
H  2.885174 0.379916 1.41577
H  2.926356 -0.227606 3.07182
H  4.532471 -2.899029 4.231398
H  2.9225 -2.16454 4.273692
H  3.097671 -3.92762 4.175682
H  -1.138477 -1.503652 2.52524
H  -2.972443 -3.149898 1.483103
H  -2.474932 -1.947874 0.252203
H  -1.839587 -4.386962 -0.607412
H  -0.907157 -3.825234 3.39904
H  -1.718563 -5.309722 1.730106
H  0.638372 -3.650786 2.646278
F  1.088765 -2.640076 -2.587483
H  -0.06541 -5.400632 1.10225
H  0.79214 -3.735763 -0.454389
totalener: -2253.20707052187026 hartree
nucrepener: 5780.84112549659039 hartree
electener: -8034.04819601846066 hartree
twoeener: 6624.11885628706113 hartree
kineticenergy: 2174.78465555509638 hartree
exchangeener: -275.517232717251 hartree
correlationener: -10.526848421553 hartree
xcener: -286.044081138804 hartree
dispersion: -0.041562519 hartree
dispersion: -0.041558065 hartree
dispersion: -0.041569606 hartree
dispersion: -0.041566096 hartree
dispersion: -0.041575431 hartree
dispersion: -0.041543701 hartree
dispersion: -0.041546349 hartree
dispersion: -0.041519964 hartree
dispersion: -0.041512358 hartree
dispersion: -0.041495589 hartree
dispersion: -0.041485783 hartree
dispersion: -0.041472013 hartree
dispersion: -0.041460927 hartree
dispersion: -0.041445185 hartree
dispersion: -0.041411632 hartree
dispersion: -0.041349494 hartree
dispersion: -0.041347074 hartree
dispersion: -0.041329601 hartree
dispersion: -0.041311257 hartree
dispersion: -0.041292965 hartree
dispersion: -0.041271617 hartree
dispersion: -0.041220753 hartree
dispersion: -0.041129802 hartree
dispersion: -0.041080092 hartree
dispersion: -0.040971255 hartree
dispersion: -0.041035100 hartree
dispersion: -0.041035458 hartree
dispersion: -0.041040761 hartree
dispersion: -0.041024565 hartree
dispersion: -0.041010693 hartree
dispersion: -0.040999976 hartree
dispersion: -0.041005124 hartree
dispersion: -0.041016939 hartree
dispersion: -0.041045618 hartree
dispersion: -0.041261933 hartree
dispersion: -0.040746784 hartree
dispersion: -0.040993700 hartree
dispersion: -0.041021852 hartree
dispersion: -0.041130668 hartree
dispersion: -0.041103292 hartree
dispersion: -0.041176059 hartree
dispersion: -0.041135006 hartree
dispersion: -0.041054360 hartree
dispersion: -0.041087773 hartree
dispersion: -0.041160437 hartree
dispersion: -0.041126650 hartree
dispersion: -0.041093407 hartree
dispersion: -0.041108947 hartree
dispersion: -0.041140917 hartree
dispersion: -0.041119177 hartree
dispersion: -0.041117360 hartree
dispersion: -0.041100717 hartree
dispersion: -0.041098641 hartree
dispersion: -0.041098379 hartree
dispersion: -0.041094742 hartree
dispersion: -0.041096632 hartree
dispersion: -0.041097290 hartree
dispersion: -0.041101272 hartree
dispersion: -0.041099015 hartree
dispersion: -0.041098101 hartree
energy: -667.0944 -667.0102 -667.0054 -666.9447 -666.8630 -666.8240 -666.5517 -666.5385 -666.4640 -664.3033 -275.7836 -275.7146 -275.6654 -275.5919 -275.5274 -275.5125 -275.4496 -275.4277 -275.3258 -275.0296 -274.8619 -274.8427 -274.6791 -274.5258 -274.1230 -274.0523 -273.9818 -273.9121 -273.7809 -273.6828 -273.6349 -273.6082 -273.5074 -273.4943 -273.3815 -273.3518 -273.2544 -272.8811 -272.6827 -180.1110 -87.6639 -54.6019 -53.8381 -53.4556 -32.9461 -32.8761 -32.6299 -32.5880 -32.4414 -32.4285 -32.1048 -32.0934 -32.0444 -29.4145 -24.5955 -23.7011 -22.9303 -22.9212 -21.4413 -21.3762 -20.8813 -19.8992 -19.7217 -19.6977 -19.6545 -19.5051 -19.4646 -19.4077 -19.2035 -18.5637 -17.2360 -16.9649 -16.9551 -16.6661 -16.5484 -16.4539 -15.6735 -15.0913 -14.8082 -14.6341 -14.4201 -14.3821 -14.2713 -14.2679 -14.2209 -14.0517 -13.8547 -13.4462 -13.4016 -13.3411 -13.1959 -13.0502 -12.9593 -12.7565 -12.7242 -12.6170 -12.4019 -12.3515 -12.1105 -11.9408 -11.9097 -11.8765 -11.7991 -11.7164 -11.6758 -11.6048 -11.5594 -11.3665 -11.1160 -11.0560 -11.0293 -11.0016 -10.9565 -10.8506 -10.8050 -10.7154 -10.6995 -10.6197 -10.5327 -10.4666 -10.4176 -10.3819 -10.2064 -10.1395 -10.0697 -9.7192 -9.6899 -9.6454 -9.6369 -9.5409 -9.4828 -9.4514 -9.4009 -9.2445 -9.1672 -9.0582 -8.9575 -8.8928 -8.7911 -8.6805 -8.4696 -8.3720 -8.2540 -8.0378 -7.7271 -7.2849 -6.9780 -6.8435 -6.6063 -6.4234 -6.2162 -6.0206 -5.8617 -5.7929 -5.3212 -3.5429 -2.5185 -1.0060 -0.8617 -0.6289 -0.4622 -0.2913 -0.2658 -0.1378 -0.0756 -0.0367 electronvolt
chargesum: 0.0000000
charge: 0.296274 -0.092555 0.092562 -0.425883 0.087465 0.245887 0.242731 0.045804 0.260766 -0.416679 -0.023807 0.235504 0.106138 0.135389 -0.214511 -0.184038 -0.178076 -0.196659 0.300639 0.036932 0.239011 0.146236 0.071178 0.077792 0.152954 -0.205884 -0.205597 -0.183709 -0.185265 -0.184499 0.296824 0.088349 -0.615608 -0.336312 -0.334432 -0.575480 -0.519345 -0.569462 -0.608190 -0.576150 0.171142 0.155727 0.158567 0.171250 0.150015 0.209945 0.165626 0.223161 0.167587 0.167692 0.169929 0.156695 0.178138 0.168787 0.157378 0.192286 0.172871 0.195308 0.179927 0.177122 0.171681 0.133858 -0.439815 0.158959 0.159873
charge: -0.062747 -0.030131 -0.080760 -0.165027 -0.078147 -0.025764 -0.017981 -0.046892 -0.013353 -0.350579 0.209771 0.230835 0.227866 0.221885 -0.271035 -0.248690 -0.245427 -0.249965 0.107379 -0.100260 0.234338 0.229916 0.220254 0.218176 0.231799 -0.258677 -0.256142 -0.248111 -0.242477 -0.249910 -0.167459 -0.148539 -0.243283 -0.220849 -0.267078 -0.365407 -0.362842 -0.363783 -0.354802 -0.356286 0.168767 0.167440 0.170134 0.174828 0.168728 0.192847 0.174754 0.201796 0.179351 0.170437 0.179756 0.173588 0.178137 0.174853 0.171398 0.179658 0.166473 0.182806 0.180808 0.172032 0.164734 0.205870 -0.366086 0.170194 0.256881
qa: 0.2963 -0.0926 0.0926 -0.4259 0.0875 0.2459 0.2427 0.0458 0.2608 -0.4167 -0.0238 0.2355 0.1061 0.1354 -0.2145 -0.1840 -0.1781 -0.1967 0.3006 0.0369 0.2390 0.1462 0.0712 0.0778 0.1530 -0.2059 -0.2056 -0.1837 -0.1853 -0.1845 0.2968 0.0883 -0.6156 -0.3363 -0.3344 -0.5755 -0.5193 -0.5695 -0.6082 -0.5762 0.1711 0.1557 0.1586 0.1713 0.1500 0.2099 0.1656 0.2232 0.1676 0.1677 0.1699 0.1567 0.1781 0.1688 0.1574 0.1923 0.1729 0.1953 0.1799 0.1771 0.1717 0.1339 -0.4398 0.1590 0.1599
va: 3.1079 3.5934 3.1567 3.6491 3.6894 3.4057 3.5605 3.8266 3.3771 4.3495 3.5665 3.5299 3.5928 3.6425 0.9871 1.0272 1.0303 1.0057 3.8124 3.3567 3.5424 3.6322 3.6476 3.6778 3.6412 0.9968 0.9994 1.0243 1.0328 1.0253 3.1870 3.4459 3.7603 3.6993 3.6658 3.7311 3.7027 3.6864 3.6301 3.7238 0.9539 0.9606 0.9652 0.9539 0.9650 0.9501 0.9563 0.9454 0.9604 0.9547 0.9642 0.9611 0.9538 0.9604 0.9626 0.9525 0.9587 0.9524 0.9635 0.9563 0.9552 0.9722 0.8636 0.9688 0.9648
dispersion: -0.041094355 hartree
energy: -2253.243495428098 hartree
dipole: -45.968514166 49.003957631 3.035443465 27.112080235 -29.029977485 -1.917897251 -50.916160260 54.861091389 3.944931129
dipolemethod: SCF
magnitude: 5.334297377 au
magnitude: 13.558706405 debye
temp: 298.15 k
press: 1.00 atm
zeropoint: 0.46677995 hartree
thermalvibcorrection: 0.03611007 hartree
thermalrotcorrection: 0.00141627 hartree
thermaltrasncorrection: 0.00141627 hartree
thermaltotal: -2252.73777286 hartree
thermalcorr: 0.03894262 hartree
nonthermalcorr: 0.46677995 hartree
totalcorr: 0.50572256 hartree
thermalcorrenthalpy: 0.00094421 hartree
totalenthalpy: -2252.73682865 hartree
vibrat: 0.06410047 hartree
rotat: 0.01796902 hartree
transl: 0.02157821 hartree
total: 0.10364770 hartree
totalentropycorr: -0.10364770 hartree
gibbsenthalpy: -2252.84047635 hartree
gibbsminuselec: 0.40301908 hartree
