program: Orca
programVersion: 6.0.1
elementType: C C C C C C C C C Rh C C C C F F F F B C C C C C C F F F F F C C C C C C C C C C H H H H H H H H H H H H H H H H H H H H H H F H H
elementType: Rh
charge: 0
multiplicity: 1
keywords: r2scan0 d4 ma-def2-qzvp SP TIGHTSCF AIM NBO SMD(toluene)
formula: C29H24BF10Rh
InChI: InChI=1/C19H9BF10.C10H15.Rh/c21-11-7-6-4-1-2-5(3-4)8(6)20(30,9(7)12(22)16(26)15(11)25)10-13(23)17(27)19(29)18(28)14(10)24;1-6-7(2)9(4)10(5)8(6)3;/h4-5,8H,1-3H2;1-5H3;/rC29H24BF10Rh/c1-23-24(2)26(4)27(5)25(23,3)41(23,24,26,27)28-9-6-7-10(8-9)29(28,41)30(40,12-11(28)14(31)18(35)19(36)15(12)32)13-16(33)20(37)22(39)21(38)17(13)34/h9-10,29H,6-8H2,1-5H3
65 atoms
C  0.072377 -1.939357 0.719944
C  0.160815 -0.617922 0.088062
C  0.143605 -0.687975 -1.316855
C  -0.103482 -3.024239 -0.345019
C  3.80201 -4.016476 1.45871
C  3.538059 -2.887833 2.348178
C  3.740062 -3.528532 0.143282
C  3.463241 -1.676753 1.579222
C  3.496694 -2.072678 0.197935
Rh 1.785603 -2.987075 1.085269
C  0.30117 0.602759 0.735097
C  0.318926 0.479718 -2.030553
C  0.477195 1.707123 -1.393937
C  0.464364 1.767075 -0.001083
F  0.30866 0.682951 2.086396
F  0.615409 2.948318 0.613355
F  0.622892 2.839689 -2.092945
F  0.305325 0.472158 -3.375833
B  -0.052077 -2.218817 -1.833718
C  -1.411414 -2.549313 -2.67188
C  -2.480911 -1.684935 -2.877383
C  -1.567691 -3.818311 -3.227134
C  -3.611157 -2.026955 -3.61267
C  -2.675676 -4.205224 -3.967149
C  -3.707292 -3.295983 -4.164216
F  -0.61999 -4.758241 -3.025747
F  -2.476113 -0.442547 -2.35172
F  -4.607485 -1.149152 -3.791261
F  -4.786664 -3.644702 -4.87168
F  -2.77365 -5.440811 -4.477726
C  -1.317399 -3.838186 0.179038
C  -0.943346 -2.292328 1.796637
C  -2.125609 -2.748348 0.912866
C  -0.462864 -3.644185 2.414254
C  -0.876366 -4.712222 1.362754
C  4.050062 -5.41845 1.905798
C  3.510879 -2.974226 3.835758
C  3.901267 -4.284226 -1.129807
C  3.514792 -1.162916 -0.976512
C  3.420833 -0.28264 2.099782
H  5.060094 -5.521737 2.32234
H  3.345149 -5.727527 2.683724
H  3.958033 -6.122602 1.076236
H  4.916645 -4.139514 -1.522264
H  3.741814 -5.355573 -0.989345
H  3.198233 -3.926293 -1.887826
H  4.554721 -0.989813 -1.286909
H  2.967276 -1.586984 -1.822074
H  3.067254 -0.195794 -0.73569
H  4.440416 0.108952 2.212731
H  2.885174 0.379916 1.41577
H  2.926356 -0.227606 3.07182
H  4.532471 -2.899029 4.231398
H  2.9225 -2.16454 4.273692
H  3.097671 -3.92762 4.175682
H  -1.138477 -1.503652 2.52524
H  -2.972443 -3.149898 1.483103
H  -2.474932 -1.947874 0.252203
H  -1.839587 -4.386962 -0.607412
H  -0.907157 -3.825234 3.39904
H  -1.718563 -5.309722 1.730106
H  0.638372 -3.650786 2.646278
F  1.088765 -2.640076 -2.587483
H  -0.06541 -5.400632 1.10225
H  0.79214 -3.735763 -0.454389
elementType: C Rh F B H
totalener: -2253.09280436197469 hartree
nucrepener: 5767.67234173872566 hartree
electener: -8020.73815887285764 hartree
twoeener: 6611.32111340546817 hartree
cpcmener: -0.01966957388470 hartree
kineticenergy: 2173.77315017194542 hartree
exchangeener: -206.670152561697 hartree
energy: -679.6340 -679.5739 -679.5034 -679.4746 -679.4534 -679.3857 -679.1574 -679.1326 -679.0412 -676.7800 -284.2977 -284.1900 -284.1036 -284.0912 -284.0699 -284.0151 -283.9927 -283.9519 -283.7550 -282.9403 -282.8086 -282.7938 -282.6382 -282.4469 -281.9941 -281.9788 -281.8833 -281.7323 -281.7018 -281.6147 -281.4973 -281.4943 -281.4574 -281.3788 -281.3431 -281.3216 -281.2643 -281.1965 -280.9620 -186.9087 -91.5596 -57.3918 -56.7725 -56.5029 -36.2306 -36.1472 -35.9461 -35.8274 -35.7747 -35.5856 -35.4362 -35.4224 -35.3455 -32.6789 -26.5787 -25.8776 -25.4956 -25.2537 -23.2629 -23.1777 -22.9995 -22.2646 -22.0828 -21.9677 -21.3960 -21.3573 -21.2171 -21.1229 -21.0516 -20.4033 -19.0651 -18.7619 -18.7499 -18.7303 -18.5868 -18.4406 -17.3887 -16.9356 -16.8502 -16.5792 -16.5031 -16.3838 -16.1291 -15.9080 -15.5663 -15.5573 -15.4808 -15.3946 -15.2805 -15.2545 -14.9966 -14.8895 -14.8271 -14.4523 -14.4310 -14.1947 -14.1469 -14.0934 -14.0020 -13.8824 -13.8236 -13.6895 -13.5759 -13.3948 -13.3813 -13.2689 -13.1452 -12.8708 -12.8555 -12.8102 -12.7746 -12.7607 -12.7151 -12.5961 -12.5733 -12.4431 -12.3231 -12.0180 -11.9425 -11.8309 -11.7710 -11.7478 -11.6979 -11.6609 -11.4696 -11.3926 -11.3394 -11.2195 -11.1914 -11.0740 -10.9282 -10.7779 -10.6484 -10.4532 -10.4004 -10.3408 -10.2056 -10.1594 -10.0905 -9.9427 -9.8207 -9.5818 -9.4492 -9.0337 -8.6449 -8.3596 -8.3231 -8.0119 -7.7932 -7.6197 -7.3518 -7.1741 -7.1044 -6.9788 -5.9848 -2.2995 -1.5732 -0.3155 -0.2028 -0.0641 0.0190 0.0839 0.1503 0.2268 0.3132 0.3756 electronvolt
chargesum: -0.0000000
charge: 0.362560 0.341809 -0.211986 -0.361386 -0.004665 -0.038443 -0.138041 -0.072538 0.155423 0.876786 -0.100275 0.248070 0.256047 0.288186 -0.318985 -0.273327 -0.273002 -0.311912 0.773886 -0.305215 0.307506 0.302818 -0.043135 0.062041 0.422606 -0.281174 -0.272849 -0.273353 -0.249099 -0.271459 -0.041261 -0.128464 -0.051854 -0.087722 -0.055815 -0.165837 -0.165905 -0.152441 -0.098319 -0.114406 0.059576 0.028033 0.046393 0.061732 0.043084 0.059756 0.036805 0.051000 0.034358 0.040802 0.034188 0.047175 0.068268 0.055560 0.042353 0.036587 0.011684 0.044162 0.048438 0.038901 0.020333 0.023293 -0.501938 0.018013 0.016575
charge: -0.189769 -0.101938 0.052972 0.066176 -0.151885 -0.164598 -0.141595 -0.157318 -0.149552 0.589316 -0.377715 -0.375921 -0.378496 -0.386795 0.308432 0.351302 0.352768 0.341223 -1.102440 0.049865 -0.363761 -0.361510 -0.377628 -0.379882 -0.378171 0.335133 0.334003 0.352507 0.360379 0.349818 -0.028238 -0.030880 0.139722 0.133782 0.113768 0.227134 0.236256 0.244492 0.250349 0.244472 -0.017172 -0.018560 -0.019385 -0.010491 -0.017754 -0.003743 -0.006617 -0.000599 -0.003689 -0.011312 -0.007525 -0.010344 -0.008677 -0.013232 -0.015006 0.001460 -0.005009 0.009598 0.001481 -0.006880 -0.012194 -0.005424 0.316245 -0.011803 0.040855
qa: 0.3626 0.3418 -0.2120 -0.3614 -0.0047 -0.0384 -0.1380 -0.0725 0.1554 0.8768 -0.1003 0.2481 0.2560 0.2882 -0.3190 -0.2733 -0.2730 -0.3119 0.7739 -0.3052 0.3075 0.3028 -0.0431 0.0620 0.4226 -0.2812 -0.2728 -0.2734 -0.2491 -0.2715 -0.0413 -0.1285 -0.0519 -0.0877 -0.0558 -0.1658 -0.1659 -0.1524 -0.0983 -0.1144 0.0596 0.0280 0.0464 0.0617 0.0431 0.0598 0.0368 0.0510 0.0344 0.0408 0.0342 0.0472 0.0683 0.0556 0.0424 0.0366 0.0117 0.0442 0.0484 0.0389 0.0203 0.0233 -0.5019 0.0180 0.0166
va: 3.0474 2.7709 2.7779 3.4914 3.4433 3.5331 3.4232 3.1705 3.1197 4.2150 3.3674 3.0689 3.3753 3.3278 0.8343 0.8659 0.8670 0.8374 2.2642 2.8920 3.2303 3.1967 3.7548 3.6446 3.3306 0.8672 0.8002 0.9113 0.8956 0.9008 3.6294 3.7594 3.6574 3.8298 3.8073 3.7885 3.7960 3.8096 3.7296 3.7895 0.9972 0.9999 1.0021 0.9960 0.9989 1.0081 0.9897 0.9979 1.0028 1.0025 1.0249 0.9879 0.9970 0.9949 0.9947 1.0087 1.0059 1.0081 1.0002 1.0102 0.9922 1.0244 0.3854 1.0010 0.9285
dispersion: -0.044027351 hartree
energy: -2253.136831713140 hartree
dipole: -45.968514166 49.602941537 3.634427371 27.112080235 -29.613833339 -2.501753104 -50.916160260 55.787823252 4.871662992
dipolemethod: SCF
magnitude: 6.572741529 au
magnitude: 16.706581274 debye
