program: Orca
programVersion: 6.0.1
elementType: C C C C C C C C C Rh C C C C F F F F B C C C C C C F F F F F C C C C C C C C C C F H H H H H H H H H H H H H H H H H H H H H H H H
elementType: Rh
charge: 0
multiplicity: 1
keywords: r2scan0 d4 ma-def2-qzvp SP TIGHTSCF NBO AIM SMD(toluene)
formula: C29H24BF10Rh
InChI: InChI=1/C19H7BF10.C10H15.Rh.2H/c21-11-7-6-4-1-2-5(3-4)8(6)20(30,9(7)12(22)16(26)15(11)25)10-13(23)17(27)19(29)18(28)14(10)24;1-6-7(2)9(4)10(5)8(6)3;;;/h1-2,4-5,8H,3H2;1-5H3;;;/rC29H24BF10Rh/c1-9-24(2)26(4)27(5)25(9,3)41(24,26,27)28-11-7-6-10(8-11)21(28)30(40,12-13(31)15(33)17(35)16(34)14(12)32)22-19(37)18(36)20(38)23(39)29(22,28)41/h6-7,10-11,21H,8,41H2,1-5H3
65 atoms
C  -0.712087 -0.584175 2.259263
C  -0.968844 0.558738 1.395452
C  -1.011586 0.197404 0.011188
C  -0.633178 -1.870437 1.443959
C  2.868543 -0.397686 1.10865
C  3.203215 0.149545 2.412215
C  2.488555 0.678879 0.285344
C  3.116539 1.600138 2.334353
C  2.628241 1.920096 1.043614
Rh 1.107214 0.665618 2.235762
C  -1.077272 1.914829 1.804096
C  -1.104971 1.20201 -0.906078
C  -1.148894 2.556103 -0.521298
C  -1.154132 2.907435 0.814464
F  -1.430309 2.282926 3.049927
F  -1.244041 4.194242 1.168335
F  -1.226091 3.514518 -1.4463
F  -1.191881 0.94766 -2.221896
B  -1.000208 -1.436131 -0.133672
C  -2.430264 -2.071827 -0.617193
C  -3.64409 -1.402812 -0.716636
C  -2.484606 -3.428473 -0.93363
C  -4.827237 -2.007625 -1.12545
C  -3.639993 -4.076212 -1.350013
C  -4.823359 -3.356314 -1.449166
F  -1.379614 -4.190606 -0.815513
F  -3.738544 -0.091582 -0.389607
F  -5.967788 -1.308194 -1.203843
F  -5.949713 -3.960149 -1.841556
F  -3.633737 -5.383969 -1.642095
C  -1.55156 -2.806149 2.297873
C  -1.54255 -0.894934 3.517445
C  -2.599933 -1.798625 2.821562
C  -0.773499 -1.9453 4.304566
C  -0.776459 -3.070397 3.580835
C  2.957536 -1.830194 0.711052
C  3.814746 -0.618921 3.535431
C  2.150709 0.60951 -1.162585
C  2.40181 3.28076 0.481434
C  3.567907 2.557408 3.387765
F  0.026465 -1.84762 -1.036984
H  0.384983 -2.276029 1.422839
H  3.962949 -2.05937 0.333721
H  2.768358 -2.493547 1.560094
H  2.234445 -2.067589 -0.073761
H  3.080929 0.640687 -1.746408
H  1.615418 -0.308056 -1.416187
H  1.544359 1.461374 -1.480235
H  3.219515 3.551904 -0.199131
H  1.475724 3.327032 -0.101311
H  2.347047 4.038822 1.26553
H  4.631225 2.791033 3.24852
H  3.008444 3.494419 3.346801
H  3.445423 2.138155 4.38841
H  4.900895 -0.686616 3.39029
H  3.632723 -0.13726 4.498511
H  3.418252 -1.635675 3.582423
H  0.71742 1.33762 3.574034
H  -1.900578 -0.023698 4.066024
H  -3.295499 -2.233727 3.544775
H  -3.149404 -1.288348 2.0234
H  -0.244513 -1.751029 5.23139
H  -0.240379 -3.988255 3.799279
H  -1.922486 -3.684946 1.768715
H  0.852745 -0.388271 3.349836
elementType: C Rh F B H
totalener: -2253.02231953872206 hartree
nucrepener: 5813.27639770865244 hartree
electener: -8066.27442479821548 hartree
twoeener: 6655.29082715474397 hartree
cpcmener: -0.01761842768477 hartree
kineticenergy: 2173.46253023406553 hartree
exchangeener: -206.569291474215 hartree
energy: -680.0158 -679.9496 -679.8109 -679.6394 -679.5092 -679.4940 -679.4116 -679.2103 -679.1252 -676.7820 -285.1331 -284.8164 -284.6428 -284.3023 -284.2120 -284.1189 -284.1076 -284.0366 -283.9957 -283.0554 -282.9165 -282.8796 -282.6950 -282.6348 -282.5980 -282.4117 -281.8143 -281.5889 -281.5840 -281.5810 -281.5782 -281.4225 -281.3600 -281.3432 -281.2892 -281.2700 -281.2384 -281.2266 -280.6926 -186.8837 -92.1896 -57.7705 -57.4861 -57.2033 -36.6437 -36.3556 -36.2381 -36.0589 -35.9596 -35.7858 -35.7559 -35.4557 -35.4222 -32.6938 -26.5545 -26.2496 -25.5945 -25.5092 -23.5643 -23.1879 -23.1367 -22.5874 -22.2468 -22.0939 -21.3643 -21.3181 -21.1595 -21.0239 -20.8854 -20.3135 -19.3018 -18.9637 -18.9174 -18.7411 -18.6236 -18.4241 -17.3161 -17.1103 -16.9362 -16.8798 -16.5978 -16.4010 -16.1841 -16.0491 -15.6972 -15.5243 -15.4986 -15.4072 -15.3677 -15.3161 -15.0912 -15.0273 -14.9349 -14.7300 -14.5712 -14.4782 -14.2247 -14.2022 -14.1805 -13.9903 -13.9333 -13.8319 -13.7402 -13.6409 -13.3877 -13.3746 -13.1757 -13.1568 -12.9046 -12.8083 -12.7906 -12.7839 -12.7578 -12.5992 -12.5966 -12.3473 -12.0936 -11.9995 -11.8839 -11.8092 -11.7977 -11.7731 -11.7236 -11.6657 -11.5732 -11.4939 -11.4376 -11.3222 -11.2501 -11.1197 -11.0723 -10.9410 -10.8068 -10.4995 -10.3921 -10.3434 -10.3104 -10.1899 -10.1345 -10.0207 -9.9256 -9.6667 -9.5880 -9.2003 -8.9051 -8.6446 -8.6117 -8.3596 -7.8751 -7.6481 -7.4952 -7.2418 -7.1241 -6.9587 -6.3530 -2.7118 -1.3114 -0.5587 -0.4698 -0.2588 -0.1503 -0.0071 0.0814 0.1252 0.1909 0.2924 electronvolt
chargesum: -0.0000000
charge: -0.434416 0.180637 -0.204042 -0.271490 -0.083779 -0.046763 0.056526 -0.151836 -0.140847 1.585465 0.025254 0.055999 0.258497 0.129379 -0.348297 -0.270884 -0.258716 -0.286758 1.136472 -0.340817 0.447155 0.282610 -0.078554 0.041409 0.380791 -0.275027 -0.254130 -0.275731 -0.249320 -0.266724 -0.017634 0.044449 0.019440 -0.088863 -0.175851 -0.164074 -0.138041 -0.168310 -0.129042 -0.152482 -0.518659 -0.025338 0.046242 0.036496 0.051607 0.037493 0.052537 0.028820 0.057273 0.040083 0.054101 0.061849 0.048471 0.042453 0.063013 0.047366 0.051050 0.070099 0.060918 0.031946 0.030730 0.056554 0.058332 0.045259 0.099654
charge: -0.115868 -0.170709 0.066608 0.083406 -0.148070 -0.173924 -0.127330 -0.177461 -0.145522 0.766327 -0.386284 -0.382813 -0.376627 -0.387032 0.331475 0.362608 0.372694 0.349341 -1.108078 0.048096 -0.364412 -0.363337 -0.379188 -0.378829 -0.378293 0.339906 0.322841 0.351671 0.360492 0.351453 -0.024353 -0.040432 0.147618 0.063120 0.087508 0.233992 0.227700 0.251190 0.237711 0.229358 0.319588 0.026085 -0.012609 -0.014001 -0.006474 -0.006694 -0.004658 -0.007425 -0.009013 -0.008516 -0.012422 -0.014590 -0.018169 -0.018405 -0.011149 -0.016568 -0.015350 -0.051755 -0.000442 -0.004760 0.008171 -0.036436 -0.032732 -0.001462 -0.006767
qa: -0.4344 0.1806 -0.2040 -0.2715 -0.0838 -0.0468 0.0565 -0.1518 -0.1408 1.5855 0.0253 0.0560 0.2585 0.1294 -0.3483 -0.2709 -0.2587 -0.2868 1.1365 -0.3408 0.4472 0.2826 -0.0786 0.0414 0.3808 -0.2750 -0.2541 -0.2757 -0.2493 -0.2667 -0.0176 0.0444 0.0194 -0.0889 -0.1759 -0.1641 -0.1380 -0.1683 -0.1290 -0.1525 -0.5187 -0.0253 0.0462 0.0365 0.0516 0.0375 0.0525 0.0288 0.0573 0.0401 0.0541 0.0618 0.0485 0.0425 0.0630 0.0474 0.0511 0.0701 0.0609 0.0319 0.0307 0.0566 0.0583 0.0453 0.0997
va: 3.3605 3.1136 2.7434 3.3666 3.2561 3.2786 3.3335 3.4895 3.4073 2.4778 2.9406 3.3061 3.4982 3.3433 0.9163 0.8776 0.9064 0.8203 1.9851 2.9527 2.9948 3.2027 3.7933 3.6536 3.3815 0.8545 0.7687 0.9116 0.8963 0.9004 3.6933 3.4179 3.5818 3.6491 3.7016 3.7788 3.6985 3.7905 3.7795 3.7691 0.4046 0.9452 0.9946 0.9832 1.0050 0.9972 1.0057 0.9936 0.9980 1.0153 0.9938 0.9968 0.9964 0.9940 0.9986 0.9918 0.9915 1.0668 0.9774 0.9973 1.0137 1.0155 1.0172 1.0078 1.0500
dispersion: -0.045165827 hartree
energy: -2253.067485366062 hartree
dipole: -47.460143982 51.897283129 4.437139147 -54.787207193 56.600865246 1.813658053 -52.117279028 54.829330974 2.712051946
dipolemethod: SCF
magnitude: 5.507520776 au
magnitude: 13.999005294 debye
