program: Orca
programVersion: 6.0.1
elementType: C C C C C C C C C Rh C C C C F F F F B C C C C C C F F F F F C C C C C C C C C C F H H H H H H H H H H H H H H H H H H H H H H H H
elementType: Rh
charge: 0
multiplicity: 1
keywords: r2scan0 d4 ma-def2-qzvp SP TIGHTSCF NBO AIM SMD(toluene)
formula: C29H24BF10Rh
InChI: InChI=1/C19H6BF10.C10H15.Rh.3H/c21-11-7-6-4-1-2-5(3-4)8(6)20(30,9(7)12(22)16(26)15(11)25)10-13(23)17(27)19(29)18(28)14(10)24;1-6-7(2)9(4)10(5)8(6)3;;;;/h1-2,4-5H,3H2;1-5H3;;;;/rC29H24BF10Rh/c1-9-10(2)12(4)26(5,11(9)3)41-27-24(22(37)21(36)23(38)25(27)39)30(40,15-16(31)18(33)20(35)19(34)17(15)32)29(41)14-7-6-13(8-14)28(27,29)41/h6-7,13-14H,8H2,1-5,41H3
65 atoms
C  -1.374946 -0.190323 2.413854
C  -1.825577 1.053692 1.846187
C  -1.43551 1.115081 0.465828
C  -0.657193 -0.993036 1.47144
C  3.170869 -1.203839 1.282307
C  3.091949 -0.436632 2.403325
C  2.817186 -0.375003 0.128215
C  2.661733 0.95236 1.999108
C  2.535689 0.918209 0.540913
Rh 0.497726 0.893447 1.997343
C  -2.513237 2.11796 2.457364
C  -1.696088 2.294723 -0.222943
C  -2.381969 3.335476 0.378222
C  -2.798894 3.242654 1.719895
F  -2.868609 2.053989 3.745417
F  -3.43846 4.275893 2.267861
F  -2.678605 4.443854 -0.297317
F  -1.364088 2.418295 -1.5145
B  -0.982293 -0.39445 -0.048325
C  -2.225045 -1.278981 -0.65841
C  -3.566805 -0.918418 -0.689626
C  -1.945165 -2.549026 -1.159786
C  -4.569812 -1.738084 -1.195433
C  -2.911486 -3.401761 -1.674862
C  -4.238226 -2.990159 -1.693225
F  -0.679298 -3.015077 -1.141543
F  -3.972569 0.278993 -0.207894
F  -5.846582 -1.335858 -1.20763
F  -5.185505 -3.794989 -2.181169
F  -2.586153 -4.613085 -2.142895
C  -0.727737 -2.411924 2.103849
C  -1.815851 -1.066139 3.583093
C  -2.171327 -2.314924 2.698919
C  -0.568372 -1.609997 4.271391
C  0.063247 -2.406587 3.405389
C  3.439272 -2.667423 1.171957
C  3.380646 -0.798293 3.818414
C  2.885216 -0.872362 -1.268084
C  2.388867 2.10845 -0.361768
C  3.345231 2.100322 2.700017
F  0.068711 -0.362302 -0.973965
H  0.974723 -0.577715 2.34496
H  4.239767 -2.875541 0.452254
H  3.73098 -3.104113 2.130105
H  2.548028 -3.200844 0.813083
H  3.92234 -1.133684 -1.521501
H  2.286285 -1.782099 -1.387464
H  2.522618 -0.1348 -1.984525
H  3.352628 2.380098 -0.813117
H  1.685051 1.904932 -1.175049
H  2.01776 2.981117 0.181495
H  4.432094 1.998433 2.568853
H  3.03934 3.067057 2.2952
H  3.135045 2.100282 3.772996
H  4.262429 -0.256043 4.185486
H  2.54379 -0.532282 4.474207
H  3.577664 -1.866907 3.934552
H  0.833318 2.425597 2.191807
H  -2.591281 -0.648613 4.225006
H  -2.458364 -3.182012 3.300773
H  -2.931911 -2.105781 1.93864
H  -0.247176 -1.314029 5.26281
H  1.015562 -2.906015 3.543825
H  -0.521109 -3.229997 1.414483
H  0.462516 1.246345 3.488813
elementType: C Rh F B H
totalener: -2252.91998034051403 hartree
nucrepener: 5794.78715528333942 hartree
electener: -8047.68692343246403 hartree
twoeener: 6636.28819807975015 hartree
cpcmener: -0.01303242496630 hartree
kineticenergy: 2173.35485430629478 hartree
exchangeener: -206.502984159071 hartree
energy: -680.0623 -680.0621 -680.0318 -679.8276 -679.6986 -679.6951 -679.6132 -679.4480 -679.3809 -677.1038 -284.9116 -284.8708 -284.8493 -284.5284 -284.5170 -284.3467 -284.3392 -284.2914 -284.2542 -283.1850 -283.1529 -282.3245 -282.3219 -282.2729 -282.0770 -282.0504 -281.9144 -281.7954 -281.6845 -281.6748 -281.6494 -281.5964 -281.4240 -281.3443 -281.2034 -281.1333 -281.1238 -281.0079 -280.9965 -187.5636 -92.1100 -57.5199 -57.4454 -57.2252 -36.7648 -36.4980 -36.4434 -36.2461 -36.1725 -35.9984 -35.9627 -35.6930 -35.6577 -33.1409 -26.7687 -25.9698 -25.7517 -25.4748 -24.0478 -22.8122 -22.5380 -22.4916 -22.4447 -22.3289 -21.8501 -21.1936 -20.7911 -20.7091 -20.6880 -20.3286 -19.5311 -19.2163 -19.1554 -18.9717 -18.0064 -17.5977 -17.5688 -17.3583 -17.1828 -17.0702 -16.8395 -16.6280 -16.4885 -16.1970 -15.9450 -15.6333 -15.6268 -15.4802 -15.4275 -15.2315 -15.1712 -14.9779 -14.9686 -14.8082 -14.7224 -14.6396 -14.4489 -14.3921 -14.2378 -14.1236 -14.0126 -13.8627 -13.6161 -13.5922 -13.4541 -13.2805 -13.2391 -13.1585 -13.1134 -12.9834 -12.8643 -12.6934 -12.4811 -12.3990 -12.2677 -12.1484 -12.1063 -12.0164 -11.9974 -11.9780 -11.8506 -11.7542 -11.6164 -11.5517 -11.4226 -11.3653 -11.3251 -11.2629 -11.1742 -11.1051 -11.0079 -10.9818 -10.7984 -10.7753 -10.7082 -10.4514 -10.3901 -10.3003 -10.0972 -9.8570 -9.6646 -9.4659 -9.3893 -9.2383 -9.1902 -8.7415 -8.6355 -8.3116 -7.8052 -7.6748 -7.4796 -7.3503 -7.1334 -6.8665 -5.8471 -3.1964 -1.6156 -1.2616 -0.5900 -0.5026 -0.2664 -0.2111 -0.1051 0.0339 0.1638 0.2691 electronvolt
chargesum: -0.0000000
charge: 0.278765 0.417193 0.024402 -0.351829 -0.004223 -0.097934 0.091860 0.117402 -0.202886 0.583283 -0.215533 0.015882 0.193137 0.252390 -0.292186 -0.258760 -0.248191 -0.273328 0.952211 -0.429666 0.454443 0.368194 -0.036859 0.001553 0.408108 -0.282178 -0.275076 -0.274960 -0.246445 -0.267378 0.148401 -0.139600 0.036106 -0.115445 -0.123704 -0.152916 -0.142801 -0.124343 -0.174755 -0.127862 -0.428674 -0.136853 0.031122 0.036069 0.061157 0.035939 0.048364 0.040546 0.050674 0.059359 0.047975 0.042064 0.041667 0.052493 0.039180 0.043866 0.036247 0.001491 0.068033 0.042827 0.035686 0.069186 0.045403 0.058899 0.092808
charge: -0.111489 -0.130661 0.050846 0.022446 -0.139418 -0.153579 -0.086555 -0.238056 -0.175520 0.786838 -0.357244 -0.371131 -0.356345 -0.366807 0.360426 0.376980 0.382034 0.359545 -1.169507 0.054828 -0.358875 -0.359014 -0.377812 -0.377024 -0.376195 0.333329 0.330609 0.356979 0.365859 0.356566 -0.024504 0.006169 0.169286 0.085381 0.069978 0.207232 0.201124 0.231498 0.205703 0.190859 0.362865 0.054505 -0.021195 -0.023946 -0.013367 -0.012533 -0.004346 -0.011850 -0.019858 -0.011020 -0.018749 -0.011356 -0.024415 -0.021250 -0.017304 -0.014030 -0.022153 -0.044991 0.000696 -0.005108 0.004595 -0.028823 -0.024026 0.002944 -0.050062
qa: 0.2788 0.4172 0.0244 -0.3518 -0.0042 -0.0979 0.0919 0.1174 -0.2029 0.5833 -0.2155 0.0159 0.1931 0.2524 -0.2922 -0.2588 -0.2482 -0.2733 0.9522 -0.4297 0.4544 0.3682 -0.0369 0.0016 0.4081 -0.2822 -0.2751 -0.2750 -0.2464 -0.2674 0.1484 -0.1396 0.0361 -0.1154 -0.1237 -0.1529 -0.1428 -0.1243 -0.1748 -0.1279 -0.4287 -0.1369 0.0311 0.0361 0.0612 0.0359 0.0484 0.0405 0.0507 0.0594 0.0480 0.0421 0.0417 0.0525 0.0392 0.0439 0.0362 0.0015 0.0680 0.0428 0.0357 0.0692 0.0454 0.0589 0.0928
va: 2.7545 2.4173 2.4314 3.5733 3.3991 3.6637 3.5587 3.2519 3.4938 4.6929 3.4834 3.3723 3.4656 3.3682 0.8980 0.8842 0.9148 0.8764 2.3823 2.9487 2.9866 3.0697 3.7570 3.7139 3.3455 0.8361 0.8105 0.9121 0.9000 0.9079 3.2454 3.7214 3.5359 3.7698 3.6639 3.7641 3.8017 3.7801 3.8283 3.6428 0.4197 1.2193 0.9984 1.0000 0.9939 0.9996 0.9955 0.9985 0.9881 0.9751 0.9817 1.0001 0.9911 0.9807 0.9992 0.9853 1.0016 1.0683 0.9961 0.9933 1.0431 1.0057 1.0301 0.9657 1.0614
dispersion: -0.045309462 hartree
energy: -2252.965289802484 hartree
dipole: -10.622140920 12.663702130 2.041561209 -71.963746511 71.560396200 -0.403350311 -39.729281692 42.103299750 2.374018058
dipolemethod: SCF
magnitude: 3.156996260 au
magnitude: 8.024446780 debye
