program: Orca
programVersion: 6.0.1
elementType: C C C C C C C C C Rh C C C C F F F F B C C C C C C F F F F F C C C C C C C C C C F H H H H H H H H H H H H H H H H H H H H H H H H
elementType: Rh
charge: 0
multiplicity: 1
keywords: r2scan0 d4 ma-def2-qzvp SP TIGHTSCF NBO AIM SMD(toluene)
formula: C29H24BF10Rh
InChI: InChI=1/C19H7BF10.C10H15.Rh.2H/c21-11-7-6-4-1-2-5(3-4)8(6)20(30,9(7)12(22)16(26)15(11)25)10-13(23)17(27)19(29)18(28)14(10)24;1-6-7(2)9(4)10(5)8(6)3;;;/h1-2,4-5,8H,3H2;1-5H3;;;/rC29H24BF10Rh/c1-9-24(2)26(4)27(5)25(9,3)41(24,26,27)28-11-7-6-10(8-11)21(28)30(40,12-13(31)15(33)17(35)16(34)14(12)32)22-19(37)18(36)20(38)23(39)29(22,28)41/h6-7,10-11,21H,8,41H2,1-5H3
65 atoms
C  -0.667258 -0.494416 2.213607
C  -1.038349 0.610954 1.32617
C  -0.995703 0.231264 -0.053959
C  -0.529979 -1.789099 1.413893
C  2.777885 -0.45711 1.085548
C  3.095348 -0.018383 2.401259
C  2.502001 0.70404 0.294854
C  3.10797 1.448592 2.398296
C  2.742042 1.884817 1.090603
Rh 1.05275 0.804925 2.145971
C  -1.393816 1.935613 1.680682
C  -1.171778 1.201889 -1.002563
C  -1.445242 2.528739 -0.649882
C  -1.578939 2.889337 0.685475
F  -1.705353 2.287656 2.937726
F  -1.879612 4.151982 1.006022
F  -1.626743 3.45651 -1.587597
F  -1.166168 0.907846 -2.313754
B  -0.924985 -1.400396 -0.164038
C  -2.366435 -2.0615 -0.592775
C  -3.598426 -1.421156 -0.643234
C  -2.404376 -3.420586 -0.902673
C  -4.783583 -2.052041 -1.003831
C  -3.561445 -4.094014 -1.27116
C  -4.763567 -3.401083 -1.324608
F  -1.281041 -4.160239 -0.826212
F  -3.712117 -0.111067 -0.311481
F  -5.940522 -1.37634 -1.038843
F  -5.890895 -4.031301 -1.669843
F  -3.538204 -5.402272 -1.55966
C  -1.378275 -2.766893 2.297486
C  -1.445238 -0.845904 3.491724
C  -2.468404 -1.821483 2.847827
C  -0.583352 -1.83602 4.263038
C  -0.54977 -2.971927 3.558756
C  2.844622 -1.858868 0.590161
C  3.528514 -0.893725 3.528165
C  2.193385 0.703873 -1.160707
C  2.697278 3.289896 0.587343
C  3.598827 2.303862 3.519298
F  0.071126 -1.813459 -1.097534
H  0.501368 -2.15192 1.395293
H  3.842588 -2.046687 0.170761
H  2.692988 -2.579953 1.398252
H  2.107036 -2.05347 -0.192189
H  3.137138 0.716502 -1.723831
H  1.628241 -0.182425 -1.456572
H  1.629057 1.592622 -1.455207
H  3.617552 3.537675 0.042344
H  1.860115 3.442592 -0.100277
H  2.589008 4.004586 1.406267
H  4.692742 2.380732 3.474783
H  3.18769 3.314183 3.465572
H  3.335249 1.88325 4.492386
H  4.588074 -1.15959 3.416384
H  3.406741 -0.397202 4.493111
H  2.948299 -1.82004 3.55019
H  0.601606 1.863989 3.207187
H  -1.841289 0.003865 4.049192
H  -3.109343 -2.294047 3.597983
H  -3.076187 -1.353729 2.066199
H  -0.023155 -1.593644 5.15965
H  0.047042 -3.853956 3.767949
H  -1.710852 -3.670943 1.784908
H  0.679156 0.693217 3.668742
elementType: C Rh F B H
totalener: -2253.02269732625882 hartree
nucrepener: 5817.83268406234220 hartree
electener: -8070.83110651916468 hartree
twoeener: 6660.19604501738468 hartree
cpcmener: -0.01755912862497 hartree
kineticenergy: 2173.49962656338721 hartree
exchangeener: -206.574673401359 hartree
energy: -680.0667 -679.9476 -679.9470 -679.6310 -679.5061 -679.4842 -679.4009 -679.2187 -679.1093 -676.7881 -285.0923 -284.8963 -284.6462 -284.2901 -284.1948 -284.1141 -284.0977 -284.0307 -283.9866 -282.7766 -282.7699 -282.7656 -282.7142 -282.5765 -282.4445 -282.3717 -281.6956 -281.6688 -281.6041 -281.5597 -281.5342 -281.3738 -281.3316 -281.3147 -281.2741 -281.1636 -281.1353 -281.1151 -280.5647 -186.8532 -92.1095 -57.7048 -57.4422 -57.0886 -36.6961 -36.4505 -36.2309 -36.1330 -35.9543 -35.7790 -35.7479 -35.4527 -35.4107 -32.7116 -26.5189 -26.1734 -25.5319 -25.4798 -23.4676 -23.1536 -23.1229 -22.6069 -22.2409 -22.0855 -21.2954 -21.2628 -21.1373 -21.0080 -20.7594 -20.2167 -19.2860 -18.9463 -18.9076 -18.7342 -18.5807 -18.4302 -17.3056 -17.0936 -16.9517 -16.8795 -16.5898 -16.3947 -16.1273 -16.0174 -15.7437 -15.5080 -15.4643 -15.4082 -15.3898 -15.3061 -15.0371 -14.9632 -14.9202 -14.7282 -14.5973 -14.4721 -14.2415 -14.1853 -14.1682 -13.9826 -13.9110 -13.8169 -13.7435 -13.6523 -13.3827 -13.3635 -13.2171 -13.1876 -12.9078 -12.8273 -12.7869 -12.7560 -12.7381 -12.5921 -12.5689 -12.4722 -12.3172 -12.0083 -11.8856 -11.8337 -11.7837 -11.7666 -11.7288 -11.6288 -11.5364 -11.5120 -11.4480 -11.3684 -11.2346 -11.1706 -11.0565 -10.9790 -10.8545 -10.4494 -10.3875 -10.3236 -10.1956 -10.0968 -9.9841 -9.9193 -9.7314 -9.5748 -9.3641 -9.1951 -8.8209 -8.5989 -8.3909 -8.2620 -7.8528 -7.7528 -7.3590 -7.1963 -7.1113 -6.8741 -6.2581 -2.8835 -1.3007 -0.5023 -0.3142 -0.2413 -0.0525 -0.0085 0.0819 0.1295 0.2731 0.2894 electronvolt
chargesum: 0.0000000
charge: -0.632528 0.241615 -0.386458 -0.133523 0.073822 -0.087686 0.042230 -0.163079 -0.152031 1.293491 0.082391 0.144112 0.304125 0.135361 -0.319515 -0.281488 -0.260191 -0.287535 1.129110 -0.373123 0.463365 0.274303 -0.069826 0.034060 0.381425 -0.272061 -0.245967 -0.278197 -0.251181 -0.267440 0.018105 0.174094 0.043148 -0.057123 -0.198314 -0.209038 -0.135394 -0.180121 -0.136360 -0.132508 -0.507460 -0.057706 0.045828 0.042158 0.056486 0.045032 0.053846 0.036225 0.057830 0.038792 0.040185 0.059352 0.044996 0.040596 0.060015 0.047586 0.048794 0.134958 0.056458 0.023644 0.027427 0.057408 0.055858 0.040498 0.127122
charge: -0.134656 -0.168112 0.070849 0.078612 -0.140890 -0.163417 -0.127415 -0.184436 -0.166828 0.755686 -0.375436 -0.379260 -0.364372 -0.377605 0.340256 0.365686 0.381598 0.347816 -1.112926 0.050579 -0.363431 -0.363220 -0.379491 -0.378786 -0.378512 0.340657 0.320335 0.351754 0.360446 0.351745 -0.024335 -0.052155 0.143706 0.065692 0.081851 0.236715 0.227722 0.249451 0.228553 0.226974 0.322798 0.019108 -0.009719 -0.014113 -0.010349 -0.005645 -0.002901 -0.007711 -0.014746 -0.013934 -0.016767 -0.013240 -0.018748 -0.018386 -0.011564 -0.016234 -0.012490 -0.020509 -0.001848 -0.006118 0.006382 -0.036121 -0.033217 -0.002489 -0.002841
qa: -0.6325 0.2416 -0.3865 -0.1335 0.0738 -0.0877 0.0422 -0.1631 -0.1520 1.2935 0.0824 0.1441 0.3041 0.1354 -0.3195 -0.2815 -0.2602 -0.2875 1.1291 -0.3731 0.4634 0.2743 -0.0698 0.0341 0.3814 -0.2721 -0.2460 -0.2782 -0.2512 -0.2674 0.0181 0.1741 0.0431 -0.0571 -0.1983 -0.2090 -0.1354 -0.1801 -0.1364 -0.1325 -0.5075 -0.0577 0.0458 0.0422 0.0565 0.0450 0.0538 0.0362 0.0578 0.0388 0.0402 0.0594 0.0450 0.0406 0.0600 0.0476 0.0488 0.1350 0.0565 0.0236 0.0274 0.0574 0.0559 0.0405 0.1271
va: 3.7125 2.6054 2.9656 3.3408 3.2891 3.2115 3.3370 3.5453 3.2058 3.0405 3.0262 3.2098 3.4303 3.3385 0.9148 0.8785 0.9086 0.8232 2.0495 2.9803 2.9393 3.2179 3.7788 3.6712 3.3726 0.8438 0.7495 0.9122 0.8967 0.8992 3.6192 3.0471 3.5438 3.6395 3.7138 3.7632 3.7506 3.7794 3.7589 3.7328 0.3638 0.9729 0.9955 0.9855 1.0084 0.9942 1.0050 0.9841 0.9993 1.0017 0.9986 1.0001 0.9952 0.9942 1.0000 0.9870 0.9919 1.0719 0.9875 0.9996 1.0140 1.0166 1.0203 1.0054 1.0752
dispersion: -0.045200075 hartree
energy: -2253.067897401272 hartree
dipole: -43.938320048 48.414472905 4.476152857 -62.753532445 64.870215301 2.116682856 -46.830613982 49.613401180 2.782787199
dipolemethod: SCF
magnitude: 5.679805921 au
magnitude: 14.436919331 debye
