program: Orca
programVersion: 6.0.1
elementType: C C C C C C C C C Rh C C C C F F F F B C C C C C C F F F F F C C C C C C C C C C F H H H H H H H H H H H H H H H H H H H H H H H H
elementType: Rh
charge: 0
multiplicity: 1
keywords: r2SCAN0 d4 ma-def2-qzvp SP TIGHTSCF AIM NBO SMD(toluene)
formula: C29H24BF10Rh
InChI: InChI=1/C19H7BF9.C10H15.FH.Rh.H/c21-11-7-6-4-1-2-5(3-4)8(6)20(9(7)12(22)16(26)15(11)25)10-13(23)17(27)19(29)18(28)14(10)24;1-6-7(2)9(4)10(5)8(6)3;;;/h1-2,4-5,8H,3H2;1-5H3;1H;;/rC29H23BF9Rh.FH/c1-9-25(2)27(4)28(5)26(9,3)40(25,27,28)29-11-7-6-10(8-11)24(29)30(13-12(29)15(31)19(35)20(36)16(13)32)14-17(33)21(37)23(39)22(38)18(14)34;/h6-7,10-11,24,40H,8H2,1-5H3;1H
65 atoms
C  -0.585413 0.268937 2.095656
C  -1.431622 1.283546 1.431711
C  -2.235769 0.765864 0.378212
C  -0.931349 -1.092595 1.441031
C  3.36298 -0.887188 0.931833
C  3.207233 -0.805775 2.382593
C  3.261337 0.412044 0.392372
C  2.960528 0.53416 2.724837
C  2.90224 1.306251 1.490065
Rh 1.272013 -0.001429 1.244721
C  -1.448708 2.638647 1.708378
C  -2.94586 1.656059 -0.42361
C  -2.939752 3.016918 -0.158042
C  -2.194584 3.503467 0.918455
F  -0.690989 3.160041 2.695792
F  -2.187433 4.814695 1.16259
F  -3.627769 3.876313 -0.918158
F  -3.643511 1.234362 -1.48505
B  -2.047325 -0.761667 0.350821
C  -2.884468 -1.85011 -0.38422
C  -4.265194 -1.7365 -0.570707
C  -2.308362 -3.042755 -0.833383
C  -5.023681 -2.710166 -1.204708
C  -3.02998 -4.028213 -1.489118
C  -4.397423 -3.858243 -1.674318
F  -1.000283 -3.271073 -0.647234
F  -4.924918 -0.677984 -0.081513
F  -6.343259 -2.5672 -1.353692
F  -5.108075 -4.803728 -2.285784
F  -2.436165 -5.14184 -1.927909
C  -1.398219 -1.955487 2.676153
C  -0.873038 0.034408 3.611429
C  -2.135827 -0.86433 3.492123
C  0.1235 -0.99571 4.110741
C  -0.187913 -2.17216 3.558324
C  3.68889 -2.138567 0.186121
C  3.399559 -1.968155 3.296636
C  3.5111 0.821102 -1.022136
C  2.827635 2.794871 1.422551
C  2.84226 1.144165 4.081892
F  -0.121289 -0.636491 -1.721856
H  -0.057992 -1.611597 0.938314
H  4.761688 -2.36342 0.256855
H  3.147071 -2.998526 0.590394
H  3.433383 -2.049858 -0.872207
H  4.573723 1.056814 -1.166452
H  3.243341 0.028192 -1.724944
H  2.932903 1.708557 -1.288859
H  3.820914 3.235368 1.588661
H  2.468719 3.131279 0.447333
H  2.149599 3.190491 2.183065
H  3.665604 1.850526 4.247907
H  1.9065 1.702216 4.192238
H  2.889779 0.393265 4.873035
H  4.460298 -2.249679 3.33428
H  3.075425 -1.748421 4.315497
H  2.844636 -2.845356 2.950305
H  0.325165 -0.200272 -0.993221
H  -0.966337 0.948865 4.200284
H  -2.491755 -1.229036 4.460507
H  -2.957734 -0.387782 2.944385
H  0.971344 -0.773593 4.744206
H  0.362945 -3.103393 3.632428
H  -1.963114 -2.847517 2.394748
H  0.618478 0.815024 0.073244
elementType: C Rh F B H
totalener: -2253.00121032785773 hartree
nucrepener: 5636.10490958221817 hartree
electener: -7889.08373427454444 hartree
twoeener: 6478.53452562827533 hartree
cpcmener: -0.01505889163817 hartree
kineticenergy: 2173.59338321701398 hartree
exchangeener: -206.575046939512 hartree
energy: -680.0630 -679.8730 -679.8693 -679.8551 -679.7031 -679.6728 -679.6368 -679.4806 -679.4770 -677.7284 -284.8700 -284.6711 -284.6698 -284.6406 -284.5627 -284.5570 -284.3511 -284.2739 -284.0722 -282.3017 -282.2684 -282.1777 -282.1429 -282.1273 -282.1144 -282.0437 -281.8143 -281.7844 -281.6425 -281.5661 -281.4500 -281.3525 -281.3483 -281.2965 -281.2826 -281.2781 -281.2409 -281.2304 -281.2188 -187.4997 -91.0422 -56.7539 -56.2446 -56.0361 -36.6872 -36.4454 -36.3994 -36.2696 -36.1031 -35.9935 -35.9541 -35.7837 -35.7141 -33.7083 -26.1132 -26.0309 -25.9784 -25.4514 -23.2612 -22.8586 -22.8121 -22.7567 -22.6143 -22.3095 -21.4195 -21.0208 -20.9531 -20.8502 -20.7372 -20.2711 -19.5843 -19.2441 -19.0289 -18.7845 -18.3648 -18.0803 -17.4123 -17.2518 -17.0850 -17.0450 -16.8523 -16.5967 -16.1758 -15.9423 -15.8836 -15.7693 -15.5585 -15.3838 -15.2506 -15.2081 -15.1602 -15.0966 -15.0918 -15.0556 -14.8786 -14.6926 -14.5801 -14.3923 -14.2330 -14.0887 -13.9366 -13.8553 -13.8062 -13.6904 -13.5972 -13.5476 -13.3417 -13.1843 -13.1551 -12.9606 -12.9116 -12.6027 -12.5725 -12.4896 -12.3673 -12.2924 -12.2452 -12.1293 -11.7565 -11.7115 -11.6782 -11.6137 -11.5549 -11.5341 -11.5097 -11.4234 -11.3806 -11.2844 -11.2185 -11.0978 -10.9635 -10.9336 -10.7807 -10.5673 -10.4440 -10.3346 -10.2544 -10.0172 -9.9905 -9.9693 -9.8889 -9.7471 -9.5876 -9.2077 -8.6470 -8.1170 -7.9407 -7.8223 -7.5665 -7.5513 -7.4989 -7.2343 -7.0820 -6.3321 -5.9876 -2.3270 -1.5309 -0.7781 -0.4655 -0.3351 -0.2938 -0.0928 0.0481 0.1880 0.2338 0.2991 electronvolt
chargesum: -0.0000000
charge: 0.645058 -0.093119 0.182734 -0.128157 -0.093639 -0.008711 -0.038982 0.013516 -0.123003 0.740951 -0.132077 0.201915 0.201791 0.280784 -0.305948 -0.247591 -0.267168 -0.268058 0.088558 -0.155370 0.392966 0.424172 -0.013019 -0.040095 0.450747 -0.244083 -0.261826 -0.259924 -0.233724 -0.267021 0.032029 -0.008085 -0.100514 -0.158648 -0.145709 -0.156786 -0.191766 -0.142620 -0.117154 -0.172060 -0.358597 0.012678 0.055634 0.033302 0.041086 0.048313 0.043115 0.047282 0.048660 0.045364 0.040244 0.041865 0.071202 0.033095 0.051260 0.036258 0.044065 0.325748 0.054915 0.018283 0.030119 0.032160 0.043877 0.042341 -0.162634
charge: -0.200700 -0.090263 0.046429 0.042836 -0.166919 -0.150720 -0.188956 -0.160827 -0.201904 0.594238 -0.369481 -0.358108 -0.371276 -0.365573 0.316821 0.371797 0.356721 0.356967 -0.452388 0.050311 -0.350799 -0.352780 -0.371304 -0.372348 -0.366230 0.351831 0.359603 0.366302 0.379241 0.364629 -0.010342 -0.041336 0.146623 0.068291 0.078434 0.223064 0.216644 0.219827 0.222445 0.223376 0.391623 0.047039 -0.016490 -0.017598 -0.017749 -0.018207 -0.018815 -0.017687 -0.014897 -0.015186 -0.011230 -0.013600 -0.008180 -0.021609 -0.015035 -0.019914 -0.015692 -0.498318 0.001362 -0.008382 0.005340 -0.030389 -0.030292 0.000250 -0.050524
qa: 0.6451 -0.0931 0.1827 -0.1282 -0.0936 -0.0087 -0.0390 0.0135 -0.1230 0.7410 -0.1321 0.2019 0.2018 0.2808 -0.3059 -0.2476 -0.2672 -0.2681 0.0886 -0.1554 0.3930 0.4242 -0.0130 -0.0401 0.4507 -0.2441 -0.2618 -0.2599 -0.2337 -0.2670 0.0320 -0.0081 -0.1005 -0.1586 -0.1457 -0.1568 -0.1918 -0.1426 -0.1172 -0.1721 -0.3586 0.0127 0.0556 0.0333 0.0411 0.0483 0.0431 0.0473 0.0487 0.0454 0.0402 0.0419 0.0712 0.0331 0.0513 0.0363 0.0441 0.3257 0.0549 0.0183 0.0301 0.0322 0.0439 0.0423 -0.1626
va: 2.6033 2.9545 1.9521 3.3094 3.3021 3.4340 3.3765 3.4699 3.1325 4.1066 3.3915 3.2512 3.4223 3.4436 0.8478 0.9043 0.8904 0.8776 2.8144 3.0881 3.1712 3.2225 3.7217 3.7855 3.3661 0.8361 0.8679 0.9308 0.9251 0.9321 3.5725 3.6317 3.7773 3.7514 3.7023 3.7760 3.7565 3.7419 3.6812 3.7632 0.8170 0.9866 0.9947 0.9968 1.0033 0.9983 0.9964 0.9929 0.9997 0.9914 0.9920 0.9981 0.9778 0.9952 1.0015 0.9984 0.9862 1.0112 0.9714 0.9902 1.0149 1.0350 1.0151 1.0011 1.0531
dispersion: -0.042716132 hartree
energy: -2253.043926459902 hartree
dipole: -53.824423281 57.002363350 3.177940068 -17.898935510 17.242208468 -0.656727042 4.781011876 -2.569170187 2.211841689
dipolemethod: SCF
magnitude: 3.927192017 au
magnitude: 9.982128815 debye
