program: Orca
programVersion: 6.0.1
elementType: C C C C C C C C C Rh C C C C F F F F B C C C C C C F F F F F C C C C C C C C C C F H H H H H H H H H H H H H H H H H H H H H H
elementType: Rh
charge: 0
multiplicity: 1
keywords: r2scan0 d4 ma-def2-qzvp SP TIGHTSCF NBO AIM SMD(toluene)
formula: C29H22BF10Rh
InChI: InChI=1/C19H7BF10.C10H15.Rh/c21-11-7-6-4-1-2-5(3-4)8(6)20(30,9(7)12(22)16(26)15(11)25)10-13(23)17(27)19(29)18(28)14(10)24;1-6-7(2)9(4)10(5)8(6)3;/h1-2,4-5,8H,3H2;1-5H3;/rC29H22BF10Rh/c1-22-23(2)25(4)26(5)24(22,3)41(22,23,25,26)27-10-7-6-9(8-10)19(27)30(40,11-12(31)14(33)16(35)15(34)13(11)32)20-17(36)18(37)21(38)29(41,39)28(20,27)41/h6-7,9-10,19H,8H2,1-5H3
63 atoms
C  -0.555502 -0.583114 2.029196
C  -0.986962 0.548797 1.224245
C  -1.218964 0.219713 -0.144156
C  -0.638538 -1.864836 1.205787
C  2.820066 -0.405843 1.251723
C  3.114207 0.126736 2.527726
C  2.505347 0.729748 0.379801
C  3.089916 1.599739 2.423125
C  2.791439 1.963443 1.097517
Rh 1.086329 0.731553 1.956338
C  -0.844178 1.900679 1.644339
C  -1.349054 1.255061 -1.021892
C  -1.224197 2.607183 -0.62195
C  -1.006391 2.932822 0.697823
F  -0.921801 2.237305 2.974075
F  -0.916549 4.211903 1.082036
F  -1.329516 3.583529 -1.528851
F  -1.599876 1.046226 -2.323754
B  -1.177039 -1.415873 -0.313955
C  -2.596178 -2.124105 -0.699332
C  -3.841226 -1.509865 -0.745608
C  -2.607084 -3.4907 -0.971978
C  -5.017739 -2.179315 -1.065024
C  -3.753472 -4.201821 -1.298064
C  -4.971825 -3.536518 -1.347212
F  -1.459989 -4.195977 -0.90072
F  -3.971569 -0.192685 -0.46451
F  -6.191385 -1.532079 -1.103007
F  -6.09085 -4.201435 -1.655351
F  -3.70613 -5.517298 -1.552549
C  -1.441439 -2.784464 2.190016
C  -1.150505 -0.900975 3.420788
C  -2.34701 -1.75978 2.906082
C  -0.285476 -1.989202 4.035643
C  -0.463889 -3.100743 3.3132
C  2.877258 -1.824987 0.817346
C  3.507644 -0.638323 3.744473
C  2.159933 0.629569 -1.05987
C  2.675091 3.329422 0.513037
C  3.354863 2.509293 3.571742
F  -0.188976 -1.742356 -1.302171
H  0.349401 -2.311636 1.049626
H  3.893431 -2.06021 0.473045
H  2.630559 -2.508376 1.634306
H  2.19114 -2.015824 -0.012319
H  3.084618 0.519278 -1.644256
H  1.519179 -0.232786 -1.265925
H  1.650585 1.530449 -1.411572
H  3.528236 3.543182 -0.142916
H  1.767692 3.426085 -0.093106
H  2.641886 4.100404 1.285718
H  4.424837 2.510101 3.817387
H  3.054068 3.535596 3.353685
H  2.819618 2.179141 4.468004
H  4.601373 -0.707805 3.818478
H  3.147919 -0.154556 4.656991
H  3.103267 -1.652816 3.716899
H  -1.392143 -0.040839 4.04718
H  -2.918404 -2.18983 3.734868
H  -3.008391 -1.212462 2.225049
H  0.416774 -1.831733 4.847231
H  0.070576 -4.03967 3.417655
H  -1.931762 -3.639755 1.72227
elementType: C Rh F B H
totalener: -2251.84122857583407 hartree
nucrepener: 5731.36662042368062 hartree
electener: -7983.17945549965134 hartree
twoeener: 6574.37819337851124 hartree
cpcmener: -0.02136209314948 hartree
kineticenergy: 2172.59442916448734 hartree
exchangeener: -206.116605074471 hartree
energy: -679.9362 -679.8820 -679.8246 -679.5663 -679.4287 -679.4243 -679.2875 -679.0883 -679.0463 -676.6143 -284.8247 -284.6040 -284.5724 -284.2175 -284.1148 -284.0302 -284.0242 -283.9356 -283.8966 -283.1879 -282.9708 -282.8650 -282.8409 -282.6601 -282.6307 -282.1422 -281.7679 -281.7529 -281.6961 -281.6452 -281.5118 -281.4402 -281.3145 -281.2832 -281.2234 -281.1638 -281.1450 -281.1343 -280.4171 -186.6699 -91.6850 -57.5300 -56.8697 -56.6642 -36.5153 -36.1999 -36.1573 -35.9615 -35.8745 -35.7002 -35.6332 -35.3496 -35.3359 -32.4886 -26.7506 -26.0622 -25.4330 -25.3912 -23.4142 -23.3870 -23.3178 -22.4422 -22.1439 -22.0058 -21.4619 -21.3692 -21.1947 -21.1631 -20.7062 -20.1380 -19.1998 -18.8955 -18.8328 -18.7598 -18.6507 -18.5508 -17.1908 -16.9521 -16.8082 -16.7647 -16.5029 -16.3090 -16.0434 -15.8772 -15.6897 -15.6891 -15.5590 -15.3240 -15.2694 -15.2208 -14.9506 -14.9102 -14.8239 -14.5807 -14.4817 -14.3656 -14.1846 -14.1002 -14.0505 -14.0331 -13.8537 -13.7797 -13.6178 -13.5670 -13.2978 -13.2877 -13.1605 -13.0284 -12.9816 -12.9053 -12.7603 -12.7383 -12.7285 -12.7148 -12.4364 -12.1964 -12.1004 -12.0381 -11.9291 -11.8683 -11.7899 -11.6928 -11.6715 -11.6119 -11.5631 -11.4468 -11.3676 -11.2443 -11.1598 -11.0351 -10.9242 -10.8459 -10.5278 -10.4864 -10.3796 -10.3138 -10.0089 -9.9433 -9.8821 -9.6056 -9.4393 -9.0663 -8.8526 -8.5169 -8.4187 -8.2699 -8.0955 -8.0161 -7.6414 -7.2793 -7.0860 -7.0373 -6.8446 -6.1187 -2.8662 -1.7616 -0.7680 -0.1966 -0.0799 0.0157 0.0983 0.1881 0.2218 0.2625 0.3267 electronvolt
chargesum: -0.0000000
charge: 0.299592 -0.211411 -0.228078 -0.479388 0.050764 -0.046069 0.154984 -0.031574 -0.137515 1.261456 0.132585 0.097020 0.279637 0.113675 -0.314161 -0.272919 -0.263866 -0.293225 0.988771 -0.263752 0.345781 0.289722 -0.065931 0.067378 0.406333 -0.284445 -0.270897 -0.274772 -0.248993 -0.268540 0.015635 -0.018136 -0.017910 -0.096354 -0.194527 -0.132352 -0.169246 -0.126067 -0.126137 -0.152264 -0.529197 0.006309 0.048329 0.043106 0.048996 0.048676 0.047238 0.037635 0.057395 0.038843 0.056240 0.069691 0.054039 0.043270 0.055620 0.042239 0.047980 0.048058 0.021756 0.031191 0.067424 0.055812 0.044545
charge: -0.145363 -0.159332 0.069166 0.081524 -0.145305 -0.151974 -0.138327 -0.140814 -0.139497 0.647903 -0.395221 -0.372515 -0.375541 -0.384837 0.306964 0.358074 0.363056 0.350541 -1.101292 0.048611 -0.361901 -0.362665 -0.378428 -0.379528 -0.378854 0.337460 0.324398 0.349296 0.357961 0.349008 -0.025748 -0.033501 0.145603 0.066995 0.082479 0.242523 0.233423 0.256872 0.240094 0.241834 0.310205 0.019025 -0.007855 -0.009901 -0.003115 -0.002485 0.001522 -0.003945 -0.013199 -0.007287 -0.015201 -0.010391 -0.016875 -0.010750 -0.011502 -0.013521 -0.012502 -0.001945 -0.007688 0.007092 -0.036846 -0.032621 -0.003356
qa: 0.2996 -0.2114 -0.2281 -0.4794 0.0508 -0.0461 0.1550 -0.0316 -0.1375 1.2615 0.1326 0.0970 0.2796 0.1137 -0.3142 -0.2729 -0.2639 -0.2932 0.9888 -0.2638 0.3458 0.2897 -0.0659 0.0674 0.4063 -0.2844 -0.2709 -0.2748 -0.2490 -0.2685 0.0156 -0.0181 -0.0179 -0.0964 -0.1945 -0.1324 -0.1692 -0.1261 -0.1261 -0.1523 -0.5292 0.0063 0.0483 0.0431 0.0490 0.0487 0.0472 0.0376 0.0574 0.0388 0.0562 0.0697 0.0540 0.0433 0.0556 0.0422 0.0480 0.0481 0.0218 0.0312 0.0674 0.0558 0.0445
va: 3.1706 3.6245 2.6743 3.4440 3.0758 3.3754 3.1711 3.4877 3.4441 3.6870 2.8743 3.2639 3.4446 3.3465 0.8634 0.8769 0.8886 0.8530 2.3414 2.9037 3.1665 3.1568 3.8256 3.6421 3.3413 0.8623 0.7738 0.9069 0.8940 0.8978 3.6850 3.5677 3.6497 3.6873 3.7228 3.8055 3.8074 3.8509 3.7882 3.8351 0.4240 0.9224 0.9955 0.9855 1.0041 0.9931 1.0092 0.9911 0.9999 1.0053 0.9977 0.9948 1.0035 0.9982 1.0026 0.9938 1.0013 1.0116 0.9995 1.0052 0.9998 1.0196 1.0090
dispersion: -0.043313716 hartree
energy: -2251.884542291863 hartree
dipole: -48.583126521 53.938187008 5.355060487 -60.952623580 63.217754738 2.265131158 -41.458325319 44.789898311 3.331572992
dipolemethod: SCF
magnitude: 6.701258881 au
magnitude: 17.033246420 debye
