program: Orca
programVersion: 6.0.1
elementType: C C C C C C C C C Rh C C C C F F F F B C C C C C C F F F F F C C C C C C C C C C F H H H H H H H H H H H H H H H H H H H H H H
elementType: Rh
charge: 0
multiplicity: 1
keywords: OPT FREQ r2scan-3c
frequency: 0.00 0.00 0.00 0.00 0.00 0.00 19.88 21.50 25.75 27.56 38.02 50.87 81.35 87.52 105.65 108.03 111.41 124.18 130.64 142.56 146.73 150.50 152.47 159.19 160.79 162.47 164.50 170.79 173.39 180.36 186.39 204.82 207.33 211.69 219.65 234.87 242.88 253.10 279.23 279.67 286.17 287.06 296.68 302.09 305.60 307.89 313.10 318.73 326.26 336.87 351.21 374.47 383.40 385.50 388.29 400.09 412.44 427.18 432.20 442.92 452.97 480.70 493.87 505.78 519.11 535.44 541.13 555.52 566.11 583.39 585.38 589.05 617.46 619.87 628.72 635.52 646.69 652.23 672.79 680.65 684.73 687.83 735.48 741.59 761.31 769.20 786.69 799.16 800.84 804.13 818.86 837.76 861.43 884.12 901.58 921.44 936.34 946.07 954.43 957.19 967.48 985.60 993.74 999.81 1004.88 1037.20 1040.65 1041.35 1043.39 1048.56 1050.72 1052.63 1066.59 1087.34 1089.80 1114.58 1120.34 1121.16 1135.29 1141.47 1157.31 1159.83 1169.60 1172.31 1203.49 1214.30 1241.69 1256.37 1270.86 1291.20 1303.76 1310.32 1313.74 1340.65 1348.08 1374.03 1382.65 1388.50 1402.67 1407.97 1408.79 1415.57 1416.55 1420.09 1424.31 1434.55 1443.69 1455.05 1465.11 1466.03 1470.18 1473.56 1476.55 1481.19 1482.43 1486.73 1491.03 1493.11 1498.09 1502.03 1507.29 1528.62 1532.68 1616.51 1638.16 1653.86 1657.86 2493.79 3005.67 3006.29 3007.15 3007.65 3008.42 3031.20 3077.67 3082.54 3086.37 3086.91 3087.96 3098.92 3114.39 3117.20 3117.85 3121.67 3127.28 3134.84 3141.77 3188.65 3206.48
frequency: 19.88 21.50 25.75 27.56 38.02 50.87 81.35 87.52 105.65 108.03 111.41 124.18 130.64 142.56 146.73 150.50 152.47 159.19 160.79 162.47 164.50 170.79 173.39 180.36 186.39 204.82 207.33 211.69 219.65 234.87 242.88 253.10 279.23 279.67 286.17 287.06 296.68 302.09 305.60 307.89 313.10 318.73 326.26 336.87 351.21 374.47 383.40 385.50 388.29 400.09 412.44 427.18 432.20 442.92 452.97 480.70 493.87 505.78 519.11 535.44 541.13 555.52 566.11 583.39 585.38 589.05 617.46 619.87 628.72 635.52 646.69 652.23 672.79 680.65 684.73 687.83 735.48 741.59 761.31 769.20 786.69 799.16 800.84 804.13 818.86 837.76 861.43 884.12 901.58 921.44 936.34 946.07 954.43 957.19 967.48 985.60 993.74 999.81 1004.88 1037.20 1040.65 1041.35 1043.39 1048.56 1050.72 1052.63 1066.59 1087.34 1089.80 1114.58 1120.34 1121.16 1135.29 1141.47 1157.31 1159.83 1169.60 1172.31 1203.49 1214.30 1241.69 1256.37 1270.86 1291.20 1303.76 1310.32 1313.74 1340.65 1348.08 1374.03 1382.65 1388.50 1402.67 1407.97 1408.79 1415.57 1416.55 1420.09 1424.31 1434.55 1443.69 1455.05 1465.11 1466.03 1470.18 1473.56 1476.55 1481.19 1482.43 1486.73 1491.03 1493.11 1498.09 1502.03 1507.29 1528.62 1532.68 1616.51 1638.16 1653.86 1657.86 2493.79 3005.67 3006.29 3007.15 3007.65 3008.42 3031.20 3077.67 3082.54 3086.37 3086.91 3087.96 3098.92 3114.39 3117.20 3117.85 3121.67 3127.28 3134.84 3141.77 3188.65 3206.48
formula: C29H22BF10Rh
InChI: InChI=1/C19H7BF10.C10H15.Rh/c21-11-7-6-4-1-2-5(3-4)8(6)20(30,9(7)12(22)16(26)15(11)25)10-13(23)17(27)19(29)18(28)14(10)24;1-6-7(2)9(4)10(5)8(6)3;/h1-2,4-5,8H,3H2;1-5H3;/rC29H22BF10Rh/c1-23-24(2)26(4)27(5)25(23,3)41(23,24,26,27)21-7-6-8(22(21)41)29(41,42-41)28(7,41)9-10(13(32)17(36)16(35)12(9)31)30(29,40)11-14(33)18(37)20(39)19(38)15(11)34/h7-8,21-22H,6H2,1-5H3
63 atoms
C  -0.484734 -0.826313 0.397948
C  -0.679589 0.218288 -0.5994
C  -0.659434 -0.299733 -1.908563
C  -0.21324 -2.155227 -0.225521
C  3.573419 -1.465443 0.263118
C  3.628107 -1.628955 1.666474
C  2.982098 -0.159793 -0.020911
C  3.054628 -0.435623 2.268745
C  2.740095 0.502831 1.223581
Rh 1.4572 -1.318789 1.065202
C  -0.848384 1.576433 -0.369189
C  -0.752828 0.589905 -2.959715
C  -0.894185 1.958043 -2.743132
C  -0.94787 2.452179 -1.439803
F  -0.893806 2.069577 0.887578
F  -1.093411 3.767109 -1.235162
F  -1.006914 2.812015 -3.76643
F  -0.756002 0.156728 -4.231931
B  -0.52824 -1.919231 -1.923405
C  -1.864459 -2.781642 -2.253301
C  -3.133706 -2.261214 -2.486991
C  -1.78212 -4.173306 -2.273918
C  -4.245657 -3.054149 -2.749108
C  -2.864139 -5.003045 -2.531016
C  -4.108594 -4.434987 -2.772769
F  -0.60512 -4.777857 -2.015504
F  -3.348922 -0.931338 -2.463991
F  -5.445166 -2.504027 -2.975268
F  -5.165571 -5.212159 -3.023422
F  -2.72944 -6.335627 -2.539326
C  -0.769181 -3.139835 0.831437
C  -1.294666 -1.094142 1.667714
C  -2.037677 -2.398853 1.302915
C  -0.138561 -1.616589 2.530782
C  0.202034 -2.873379 2.005493
C  4.057307 -2.418543 -0.777913
C  4.195806 -2.785281 2.419648
C  2.800733 0.417654 -1.38494
C  2.305714 1.916961 1.408699
C  3.002886 -0.15732 3.733531
F  0.570226 -2.34629 -2.697211
H  5.067485 -2.138911 -1.104669
H  4.09959 -3.442547 -0.399545
H  3.41053 -2.410279 -1.659476
H  3.7417 0.851139 -1.747906
H  2.479337 -0.343661 -2.101872
H  2.04381 1.205746 -1.383177
H  3.181871 2.566411 1.537504
H  1.749603 2.28317 0.542964
H  1.667535 2.036237 2.287288
H  3.968771 0.235002 4.077866
H  2.238391 0.585901 3.97235
H  2.793405 -1.063128 4.309551
H  5.227713 -2.576254 2.730867
H  3.620172 -2.997817 3.325402
H  4.208942 -3.692498 1.810992
H  -1.868915 -0.25716 2.062912
H  -2.510099 -2.869435 2.172672
H  -2.770203 -2.262987 0.499002
H  0.142401 -1.21417 3.497352
H  0.797663 -3.63805 2.49171
H  -0.870668 -4.17793 0.515202
H  0.9014 -2.38082 -0.427596
totalener: -2252.03097209730549 hartree
nucrepener: 5731.76686247850557 hartree
electener: -7983.79783457581107 hartree
twoeener: 6574.36411917332407 hartree
kineticenergy: 2173.67404857221072 hartree
exchangeener: -274.849571075892 hartree
correlationener: -10.485020414626 hartree
xcener: -285.334591490517 hartree
dispersion: -0.040368565 hartree
dispersion: -0.040245275 hartree
dispersion: -0.040160347 hartree
dispersion: -0.040104763 hartree
dispersion: -0.040154465 hartree
dispersion: -0.040179991 hartree
dispersion: -0.040197867 hartree
dispersion: -0.040192825 hartree
dispersion: -0.040180122 hartree
dispersion: -0.040167385 hartree
dispersion: -0.040165565 hartree
dispersion: -0.040170039 hartree
dispersion: -0.040178457 hartree
dispersion: -0.040184839 hartree
dispersion: -0.040186892 hartree
dispersion: -0.040186047 hartree
dispersion: -0.040183726 hartree
dispersion: -0.040182429 hartree
energy: -667.2209 -667.1801 -667.1530 -667.0838 -667.0331 -666.9994 -666.7468 -666.7338 -666.6173 -664.5654 -275.9373 -275.9152 -275.8310 -275.7575 -275.7195 -275.7086 -275.6658 -275.6462 -275.5062 -274.6746 -274.5441 -274.4484 -274.4256 -274.4214 -274.3492 -274.1609 -274.1143 -273.9252 -273.8580 -273.8519 -273.8363 -273.7925 -273.7833 -273.5828 -273.5678 -273.4137 -273.3954 -273.1392 -272.9325 -180.6282 -87.7451 -54.5640 -53.9423 -53.5850 -33.0895 -33.0602 -32.7842 -32.7733 -32.6169 -32.5922 -32.3056 -32.2876 -32.2126 -29.7506 -24.4291 -24.1381 -23.1560 -23.1207 -21.2205 -21.1814 -21.1284 -20.0963 -19.8924 -19.8536 -19.7257 -19.5456 -19.3595 -19.3061 -19.2588 -18.7879 -17.0565 -17.0100 -16.8577 -16.7964 -16.7301 -16.6451 -15.4251 -15.2940 -14.9894 -14.7643 -14.5914 -14.4578 -14.3157 -14.2217 -14.1536 -14.0798 -14.0635 -13.6858 -13.5911 -13.5128 -13.4202 -13.0085 -12.9766 -12.9128 -12.7408 -12.6537 -12.5769 -12.3869 -12.2309 -12.0694 -12.0392 -11.8091 -11.6754 -11.6299 -11.5908 -11.5744 -11.4234 -11.2598 -11.2353 -11.1987 -11.1608 -11.0957 -10.9012 -10.8137 -10.7829 -10.7108 -10.6729 -10.6013 -10.5925 -10.5515 -10.5196 -10.4411 -10.3762 -10.2609 -10.0479 -9.9956 -9.8563 -9.8297 -9.7329 -9.5964 -9.4045 -9.3295 -9.3160 -9.2764 -9.2332 -9.1996 -9.0915 -9.0445 -8.9033 -8.5914 -8.4358 -8.1241 -7.9424 -7.7432 -7.2633 -7.0366 -6.8658 -6.5334 -6.4299 -6.3568 -6.2069 -5.9950 -5.9863 -5.3690 -3.0019 -2.1682 -1.2548 -1.0554 -0.9038 -0.6548 -0.4363 -0.3986 -0.2202 -0.0439 0.0722 electronvolt
chargesum: 0.0000000
charge: 0.089261 0.082633 0.078953 -0.233773 0.215130 0.075401 0.227251 0.196134 0.126323 -0.454340 0.027971 0.215864 0.108432 0.128485 -0.207607 -0.182576 -0.176751 -0.193327 0.256589 -0.017163 0.268203 0.194381 0.068620 0.074162 0.170423 -0.207606 -0.201629 -0.181274 -0.182585 -0.182220 0.174965 0.089671 -0.532764 -0.162705 -0.231309 -0.555833 -0.574874 -0.601843 -0.593081 -0.550675 -0.404608 0.170458 0.152128 0.186383 0.165282 0.193243 0.165559 0.166163 0.163962 0.160140 0.173905 0.165045 0.159297 0.171634 0.153070 0.159153 0.177448 0.165757 0.182067 0.177528 0.175518 0.184081 0.191871
charge: -0.017883 -0.028284 -0.078791 -0.140608 -0.037215 -0.065116 -0.049680 -0.043634 -0.049316 -0.394795 0.214614 0.235030 0.231650 0.225279 -0.265163 -0.245676 -0.242422 -0.248165 0.132563 -0.100474 0.234925 0.236460 0.220191 0.220303 0.234420 -0.255580 -0.253183 -0.245845 -0.239538 -0.247235 -0.144671 -0.135171 -0.231355 -0.105117 -0.116197 -0.365213 -0.365587 -0.358691 -0.360375 -0.366512 -0.342797 0.171878 0.168720 0.181763 0.170356 0.186344 0.176763 0.168887 0.175355 0.172046 0.173436 0.171442 0.168813 0.169350 0.167008 0.169775 0.181158 0.170157 0.179766 0.186718 0.185495 0.181302 0.278319
qa: 0.0893 0.0826 0.0790 -0.2338 0.2151 0.0754 0.2273 0.1961 0.1263 -0.4543 0.0280 0.2159 0.1084 0.1285 -0.2076 -0.1826 -0.1768 -0.1933 0.2566 -0.0172 0.2682 0.1944 0.0686 0.0742 0.1704 -0.2076 -0.2016 -0.1813 -0.1826 -0.1822 0.1750 0.0897 -0.5328 -0.1627 -0.2313 -0.5558 -0.5749 -0.6018 -0.5931 -0.5507 -0.4046 0.1705 0.1521 0.1864 0.1653 0.1932 0.1656 0.1662 0.1640 0.1601 0.1739 0.1650 0.1593 0.1716 0.1531 0.1592 0.1774 0.1658 0.1821 0.1775 0.1755 0.1841 0.1919
va: 3.3527 3.4622 3.3065 3.5944 3.6090 3.7455 3.4313 3.4608 3.7234 4.6065 3.5372 3.5332 3.6176 3.6704 0.9964 1.0299 1.0331 1.0113 3.8385 3.3769 3.5044 3.6424 3.6632 3.6933 3.6332 1.0042 1.0031 1.0257 1.0356 1.0279 3.4400 3.5452 3.7203 3.7978 3.7726 3.7056 3.7430 3.6367 3.7019 3.7326 0.9063 0.9541 0.9647 0.9557 0.9562 0.9528 0.9621 0.9545 0.9643 0.9590 0.9549 0.9603 0.9603 0.9544 0.9624 0.9638 0.9598 0.9604 0.9575 0.9666 0.9666 0.9564 0.9622
dispersion: -0.040182810 hartree
energy: -2252.043078372582 hartree
dipole: -46.285870531 49.324477226 3.038606695 5.867212382 -5.720171506 0.147040876 -53.293059478 56.906509942 3.613450464
dipolemethod: SCF
magnitude: 4.723534262 au
magnitude: 12.006269939 debye
temp: 298.15 k
press: 1.00 atm
zeropoint: 0.44376126 hartree
thermalvibcorrection: 0.03553307 hartree
thermalrotcorrection: 0.00141627 hartree
thermaltrasncorrection: 0.00141627 hartree
thermaltotal: -2251.56095150 hartree
thermalcorr: 0.03836561 hartree
nonthermalcorr: 0.44376126 hartree
totalcorr: 0.48212687 hartree
thermalcorrenthalpy: 0.00094421 hartree
totalenthalpy: -2251.56000729 hartree
vibrat: 0.06311486 hartree
rotat: 0.01796013 hartree
transl: 0.02157398 hartree
total: 0.10264897 hartree
totalentropycorr: -0.10264897 hartree
gibbsenthalpy: -2251.66265627 hartree
gibbsminuselec: 0.38042210 hartree
