program: Orca
programVersion: 6.0.1
elementType: C C C C C C C C C Rh C C C C F F F F B C C C C C C F F F F F C C C C C C C C C C F H H H H H H H H H H H H H H H H H H H H H H
elementType: Rh
charge: 0
multiplicity: 1
keywords: r2scan0 d4 ma-def2-qzvp SP TIGHTSCF AIM NBO SMD(toluene)
formula: C29H22BF10Rh
InChI: InChI=1/C19H7BF10.C10H15.Rh/c21-11-7-6-4-1-2-5(3-4)8(6)20(30,9(7)12(22)16(26)15(11)25)10-13(23)17(27)19(29)18(28)14(10)24;1-6-7(2)9(4)10(5)8(6)3;/h1-2,4-5,8H,3H2;1-5H3;/rC29H22BF10Rh/c1-23-24(2)26(4)27(5)25(23,3)41(23,24,26,27)21-7-6-8(22(21)41)29(41,42-41)28(7,41)9-10(13(32)17(36)16(35)12(9)31)30(29,40)11-14(33)18(37)20(39)19(38)15(11)34/h7-8,21-22H,6H2,1-5H3
63 atoms
C  -0.484734 -0.826313 0.397948
C  -0.679589 0.218288 -0.5994
C  -0.659434 -0.299733 -1.908563
C  -0.21324 -2.155227 -0.225521
C  3.573419 -1.465443 0.263118
C  3.628107 -1.628955 1.666474
C  2.982098 -0.159793 -0.020911
C  3.054628 -0.435623 2.268745
C  2.740095 0.502831 1.223581
Rh 1.4572 -1.318789 1.065202
C  -0.848384 1.576433 -0.369189
C  -0.752828 0.589905 -2.959715
C  -0.894185 1.958043 -2.743132
C  -0.94787 2.452179 -1.439803
F  -0.893806 2.069577 0.887578
F  -1.093411 3.767109 -1.235162
F  -1.006914 2.812015 -3.76643
F  -0.756002 0.156728 -4.231931
B  -0.52824 -1.919231 -1.923405
C  -1.864459 -2.781642 -2.253301
C  -3.133706 -2.261214 -2.486991
C  -1.78212 -4.173306 -2.273918
C  -4.245657 -3.054149 -2.749108
C  -2.864139 -5.003045 -2.531016
C  -4.108594 -4.434987 -2.772769
F  -0.60512 -4.777857 -2.015504
F  -3.348922 -0.931338 -2.463991
F  -5.445166 -2.504027 -2.975268
F  -5.165571 -5.212159 -3.023422
F  -2.72944 -6.335627 -2.539326
C  -0.769181 -3.139835 0.831437
C  -1.294666 -1.094142 1.667714
C  -2.037677 -2.398853 1.302915
C  -0.138561 -1.616589 2.530782
C  0.202034 -2.873379 2.005493
C  4.057307 -2.418543 -0.777913
C  4.195806 -2.785281 2.419648
C  2.800733 0.417654 -1.38494
C  2.305714 1.916961 1.408699
C  3.002886 -0.15732 3.733531
F  0.570226 -2.34629 -2.697211
H  5.067485 -2.138911 -1.104669
H  4.09959 -3.442547 -0.399545
H  3.41053 -2.410279 -1.659476
H  3.7417 0.851139 -1.747906
H  2.479337 -0.343661 -2.101872
H  2.04381 1.205746 -1.383177
H  3.181871 2.566411 1.537504
H  1.749603 2.28317 0.542964
H  1.667535 2.036237 2.287288
H  3.968771 0.235002 4.077866
H  2.238391 0.585901 3.97235
H  2.793405 -1.063128 4.309551
H  5.227713 -2.576254 2.730867
H  3.620172 -2.997817 3.325402
H  4.208942 -3.692498 1.810992
H  -1.868915 -0.25716 2.062912
H  -2.510099 -2.869435 2.172672
H  -2.770203 -2.262987 0.499002
H  0.142401 -1.21417 3.497352
H  0.797663 -3.63805 2.49171
H  -0.870668 -4.17793 0.515202
H  0.9014 -2.38082 -0.427596
elementType: C Rh F B H
totalener: -2251.88420471720019 hartree
nucrepener: 5712.19236091226503 hartree
electener: -7964.05136877936275 hartree
twoeener: 6554.73997272274391 hartree
cpcmener: -0.01794490114918 hartree
kineticenergy: 2172.44102989085104 hartree
exchangeener: -206.112497327651 hartree
energy: -679.7348 -679.6731 -679.6019 -679.5771 -679.5650 -679.5082 -679.2831 -679.2664 -679.1652 -677.0632 -284.4250 -284.3262 -284.2258 -284.2249 -284.2142 -284.1618 -284.1418 -284.1149 -283.9169 -282.6049 -282.5333 -282.4402 -282.4136 -282.4000 -282.3491 -282.1582 -282.1187 -282.1115 -281.9214 -281.8634 -281.7658 -281.5581 -281.5182 -281.5145 -281.4116 -281.4040 -281.3810 -281.2856 -281.2064 -187.4144 -91.6510 -57.3867 -56.8758 -56.6079 -36.3426 -36.2642 -36.0611 -35.9528 -35.8921 -35.7185 -35.5717 -35.5543 -35.4799 -33.0380 -26.5212 -26.2432 -25.6240 -25.5071 -23.2691 -23.0684 -23.0042 -22.4008 -22.2114 -22.1292 -21.6867 -21.2134 -21.2081 -21.1000 -20.9463 -20.6781 -19.1817 -18.8773 -18.8327 -18.7384 -18.5497 -18.3382 -17.1631 -17.1210 -16.9865 -16.7133 -16.6556 -16.4660 -16.1290 -16.0279 -15.6439 -15.5169 -15.4169 -15.4097 -15.3855 -15.3705 -15.2188 -15.0378 -14.9325 -14.6708 -14.5744 -14.3362 -14.2883 -14.1779 -14.0242 -13.9742 -13.8526 -13.6924 -13.5167 -13.5074 -13.4857 -13.4035 -12.9803 -12.9432 -12.8872 -12.8486 -12.7584 -12.7090 -12.6621 -12.6107 -12.5392 -12.4546 -12.2896 -12.0513 -11.9131 -11.8798 -11.8514 -11.7577 -11.6903 -11.6379 -11.6109 -11.4652 -11.3809 -11.3075 -11.2132 -11.0727 -11.0484 -10.9050 -10.7913 -10.6183 -10.3297 -10.2071 -10.1956 -10.1779 -10.1570 -10.0211 -9.8465 -9.1389 -8.9896 -8.7645 -8.7231 -8.1341 -7.9572 -7.6782 -7.5160 -7.3517 -7.2876 -7.2215 -6.9711 -5.9664 -2.0146 -1.1608 -0.3553 -0.2816 -0.2093 -0.0392 -0.0227 0.0255 0.1381 0.2429 0.3631 electronvolt
chargesum: 0.0000000
charge: 0.199181 0.596250 -0.160375 -0.453795 -0.116743 -0.025925 -0.003305 -0.045041 -0.159506 1.281911 -0.162850 0.278529 0.265895 0.278807 -0.307804 -0.268047 -0.265773 -0.305793 0.824002 -0.217681 0.345047 0.289215 -0.001554 0.054701 0.397201 -0.281427 -0.268254 -0.269137 -0.247924 -0.265361 -0.274350 -0.223877 -0.022706 -0.173305 -0.093141 -0.145834 -0.152800 -0.088582 -0.127047 -0.189723 -0.497675 0.054768 0.040209 0.048664 0.038431 0.053018 0.023549 0.044825 0.033772 0.039436 0.057954 0.047472 0.039677 0.057381 0.024722 0.046546 0.037455 0.023036 0.045046 0.053003 0.046833 0.062754 0.086045
charge: -0.126080 -0.095079 0.060876 0.058664 -0.147887 -0.160948 -0.158893 -0.171035 -0.161246 0.624254 -0.374855 -0.370985 -0.374344 -0.383224 0.316503 0.355993 0.357600 0.345826 -1.089378 0.050556 -0.362454 -0.360002 -0.378327 -0.378513 -0.377003 0.338860 0.340464 0.355411 0.364253 0.353702 -0.011069 -0.019183 0.149817 0.034843 0.052988 0.236898 0.225281 0.238462 0.238970 0.227583 0.359007 -0.013604 -0.017792 -0.009809 -0.012039 -0.001395 -0.006555 -0.013373 -0.009280 -0.011009 -0.012272 -0.015599 -0.016208 -0.016722 -0.018133 -0.018494 0.003960 -0.004888 0.006332 -0.019197 -0.023429 0.000976 0.042226
qa: 0.1992 0.5963 -0.1604 -0.4538 -0.1167 -0.0259 -0.0033 -0.0450 -0.1595 1.2819 -0.1628 0.2785 0.2659 0.2788 -0.3078 -0.2680 -0.2658 -0.3058 0.8240 -0.2177 0.3450 0.2892 -0.0016 0.0547 0.3972 -0.2814 -0.2683 -0.2691 -0.2479 -0.2654 -0.2743 -0.2239 -0.0227 -0.1733 -0.0931 -0.1458 -0.1528 -0.0886 -0.1270 -0.1897 -0.4977 0.0548 0.0402 0.0487 0.0384 0.0530 0.0235 0.0448 0.0338 0.0394 0.0580 0.0475 0.0397 0.0574 0.0247 0.0465 0.0375 0.0230 0.0450 0.0530 0.0468 0.0628 0.0860
va: 3.2773 2.3803 2.7957 3.4444 3.4997 3.4460 3.2595 3.4631 3.2602 4.0512 3.4532 3.0869 3.3795 3.3575 0.8313 0.8725 0.8732 0.8532 2.3657 2.8409 3.1497 3.1961 3.7403 3.6553 3.3577 0.8551 0.8090 0.9085 0.9004 0.9013 4.0757 4.0066 3.6059 3.7849 3.7136 3.7970 3.7869 3.7423 3.8054 3.7967 0.5079 0.9969 0.9984 1.0016 0.9913 0.9805 1.0142 0.9996 1.0097 0.9879 0.9999 0.9926 0.9888 0.9991 0.9976 0.9994 0.9943 1.0101 1.0178 1.0114 1.0320 0.9872 0.9249
dispersion: -0.043241676 hartree
energy: -2251.927446393160 hartree
dipole: -46.285870531 49.891531701 3.605661171 5.867212382 -5.800714660 0.066497722 -53.293059478 57.806821757 4.513762279
dipolemethod: SCF
magnitude: 5.777479064 au
magnitude: 14.685184730 debye
