program: Orca
programVersion: 6.0.1
elementType: C C C C C C C C C Rh C C C C F F F F B C C C C C C F F F F F C C C C C C C C C C F H H H H H H H H H H H H H H H H H H H H H H
elementType: Rh
charge: 0
multiplicity: 1
keywords: r2scan0 d4 ma-def2-qzvp SP TIGHTSCF AIM NBO SMD(toluene)
formula: C29H22BF10Rh
InChI: InChI=1/C19H7BF10.C10H15.Rh/c21-11-7-6-4-1-2-5(3-4)8(6)20(30,9(7)12(22)16(26)15(11)25)10-13(23)17(27)19(29)18(28)14(10)24;1-6-7(2)9(4)10(5)8(6)3;/h1-2,4-5,30H,3H2;1-5H3;/rC29H22BF10Rh/c1-23-24(2)26(4)27(5)25(23,3)41(23,24,26,27)21-7-6-8(22(21)41)29(41)28(7,41)9-10(13(32)17(36)16(35)12(9)31)30(29,40-42-41)11-14(33)18(37)20(39)19(38)15(11)34/h7-8,21-22H,6H2,1-5H3
63 atoms
C  -0.760555 -0.618624 0.763172
C  -0.880129 0.394396 -0.289375
C  -0.828065 -0.21339 -1.572378
C  -0.681353 -1.926974 0.184456
C  3.287667 -1.62085 0.045349
C  3.44037 -1.764739 1.454096
C  2.78887 -0.278981 -0.202883
C  3.087948 -0.50641 2.076275
C  2.716874 0.415053 1.052997
Rh 1.259857 -1.345442 1.046284
C  -0.968476 1.768224 -0.165467
C  -0.817673 0.603908 -2.678576
C  -0.905123 1.993029 -2.563593
C  -0.986426 2.572786 -1.3028
F  -1.026188 2.35856 1.046804
F  -1.072302 3.903029 -1.188239
F  -0.916038 2.774094 -3.650398
F  -0.730491 0.087593 -3.91808
B  -0.749842 -1.819353 -1.409423
C  -1.728291 -2.814442 -2.18371
C  -2.868002 -2.419447 -2.881648
C  -1.5226 -4.193342 -2.115152
C  -3.728605 -3.318946 -3.501254
C  -2.352431 -5.123647 -2.723119
C  -3.466917 -4.679543 -3.423423
F  -0.472774 -4.681022 -1.42364
F  -3.201024 -1.121357 -2.972389
F  -4.808234 -2.89001 -4.163779
F  -4.285363 -5.55675 -4.007878
F  -2.101934 -6.43537 -2.634166
C  -1.137651 -2.89084 1.27839
C  -1.270044 -0.806787 2.195931
C  -2.198937 -2.034682 2.017505
C  -0.006138 -1.470495 2.775503
C  0.081625 -2.761441 2.205423
C  3.758262 -2.592124 -0.989432
C  3.984323 -2.960407 2.163574
C  2.606234 0.35793 -1.539995
C  2.371497 1.856135 1.227211
C  3.21597 -0.208365 3.533208
F  0.760807 -2.287191 -1.780865
H  4.842179 -2.486575 -1.130185
H  3.559908 -3.626561 -0.696791
H  3.27992 -2.419878 -1.955098
H  3.544106 0.827645 -1.865055
H  2.308445 -0.366079 -2.300882
H  1.839459 1.136069 -1.505978
H  3.26464 2.484229 1.111325
H  1.643834 2.182947 0.479768
H  1.946354 2.057083 2.213725
H  4.245492 0.08826 3.772233
H  2.556997 0.608629 3.838156
H  2.981031 -1.083424 4.146672
H  5.066768 -2.86102 2.32026
H  3.523677 -3.091513 3.147351
H  3.813248 -3.874298 1.589307
H  -1.650528 0.067742 2.722607
H  -2.511318 -2.472768 2.973717
H  -3.073752 -1.815431 1.39321
H  0.506927 -1.122874 3.665261
H  0.65511 -3.599092 2.585367
H  -1.412822 -3.898678 0.96916
H  1.053501 -2.192955 -0.66558
elementType: C Rh F B H
totalener: -2251.83271642536829 hartree
nucrepener: 5734.73151236441026 hartree
electener: -7986.54384031315203 hartree
twoeener: 6577.27887682477558 hartree
cpcmener: -0.01266397761472 hartree
kineticenergy: 2172.34496572110220 hartree
exchangeener: -206.069600527939 hartree
energy: -679.8514 -679.7209 -679.6941 -679.6821 -679.5771 -679.4696 -679.4686 -679.4154 -679.2737 -679.0270 -284.5796 -284.3748 -284.3700 -284.3629 -284.3453 -284.3418 -284.2108 -284.0970 -284.0318 -282.2475 -282.2372 -282.2161 -282.1597 -282.1020 -282.0696 -282.0546 -281.9550 -281.8905 -281.8677 -281.7818 -281.6784 -281.4012 -281.3842 -281.3515 -281.3389 -281.3115 -281.2648 -281.2573 -281.1644 -187.5824 -91.3221 -57.0107 -56.5821 -56.2673 -36.4705 -36.2813 -36.1968 -36.0350 -35.9662 -35.7455 -35.7220 -35.7046 -35.5527 -34.7107 -26.3510 -26.0332 -25.7854 -25.5065 -23.2858 -22.8322 -22.7909 -22.5763 -22.3660 -22.1683 -21.4106 -21.0533 -21.0171 -20.9394 -20.7644 -20.5358 -19.3624 -19.0211 -18.8742 -18.6972 -18.2936 -18.1631 -17.2611 -17.1269 -16.9897 -16.8610 -16.7675 -16.5023 -16.1309 -16.0104 -15.7600 -15.6946 -15.6555 -15.4512 -15.4162 -15.1846 -15.1776 -15.1270 -15.0390 -14.9582 -14.7512 -14.4937 -14.4178 -14.2282 -14.1286 -14.0897 -13.8427 -13.6947 -13.6493 -13.5981 -13.4781 -13.3757 -13.3047 -13.2293 -13.1338 -12.9601 -12.8873 -12.7965 -12.5920 -12.5539 -12.5277 -12.4977 -12.3982 -12.3018 -12.0932 -12.0192 -11.7955 -11.7227 -11.6349 -11.5344 -11.4898 -11.4833 -11.3391 -11.1957 -11.1738 -11.0441 -10.9504 -10.8844 -10.6342 -10.4265 -10.2305 -10.0932 -10.0682 -9.9945 -9.9705 -9.8714 -9.7148 -9.1897 -8.8372 -8.7069 -8.4832 -8.2242 -7.6703 -7.5886 -7.4489 -7.3630 -7.3224 -7.1614 -6.5403 -5.7399 -1.4379 -1.0558 -0.4540 -0.2750 -0.1945 -0.1053 -0.0568 0.0755 0.1700 0.2665 0.3855 electronvolt
chargesum: -0.0000000
charge: -0.393478 0.775698 -0.255962 -0.552486 -0.102254 -0.026302 0.011939 -0.065357 -0.161882 1.618025 -0.159641 0.208643 0.225528 0.306857 -0.308510 -0.269186 -0.270899 -0.298614 0.945467 -0.258479 0.399369 0.237253 -0.030902 0.002690 0.453848 -0.261070 -0.270548 -0.265702 -0.241057 -0.271336 -0.160133 -0.279860 -0.023832 -0.161279 -0.040901 -0.173743 -0.163723 -0.108367 -0.137171 -0.198642 -0.335670 0.045831 0.052462 0.045729 0.033584 0.033597 0.021590 0.040174 0.031439 0.041462 0.054939 0.047622 0.033251 0.056083 0.026181 0.046890 0.040662 0.024723 0.016026 0.066277 0.040940 0.042008 0.220198
charge: -0.118302 -0.078392 0.062711 -0.008454 -0.165506 -0.172953 -0.161706 -0.165890 -0.163234 0.601250 -0.377570 -0.377913 -0.378891 -0.383809 0.321326 0.358290 0.355354 0.340899 -0.876248 0.055241 -0.352835 -0.351318 -0.373882 -0.375716 -0.373547 0.338401 0.350523 0.359926 0.368452 0.357064 -0.022476 -0.013230 0.150348 0.021524 0.029568 0.228684 0.221554 0.235997 0.234356 0.222082 0.500688 -0.015590 -0.016984 -0.016686 -0.011576 -0.007727 -0.006505 -0.015227 -0.010285 -0.013286 -0.014934 -0.017581 -0.017828 -0.016899 -0.018809 -0.016847 -0.002719 -0.009318 -0.001900 -0.022523 -0.024839 0.000286 -0.144592
qa: -0.3935 0.7757 -0.2560 -0.5525 -0.1023 -0.0263 0.0119 -0.0654 -0.1619 1.6180 -0.1596 0.2086 0.2255 0.3069 -0.3085 -0.2692 -0.2709 -0.2986 0.9455 -0.2585 0.3994 0.2373 -0.0309 0.0027 0.4538 -0.2611 -0.2705 -0.2657 -0.2411 -0.2713 -0.1601 -0.2799 -0.0238 -0.1613 -0.0409 -0.1737 -0.1637 -0.1084 -0.1372 -0.1986 -0.3357 0.0458 0.0525 0.0457 0.0336 0.0336 0.0216 0.0402 0.0314 0.0415 0.0549 0.0476 0.0333 0.0561 0.0262 0.0469 0.0407 0.0247 0.0160 0.0663 0.0409 0.0420 0.2202
va: 3.5338 2.2452 2.9228 2.7854 3.4877 3.3520 3.2220 3.5147 3.2660 3.1415 3.4798 3.1531 3.4234 3.3654 0.8415 0.8738 0.8798 0.8384 2.0238 2.5523 3.1342 3.3213 3.7363 3.7391 3.3157 0.8358 0.8540 0.9219 0.9083 0.9195 3.9077 4.0170 3.6481 3.7297 3.6505 3.7673 3.7788 3.7075 3.8152 3.8117 0.7298 0.9982 0.9887 0.9979 0.9973 0.9912 1.0163 0.9984 1.0173 0.9910 1.0007 0.9901 0.9879 0.9982 0.9966 0.9939 0.9952 1.0127 1.0294 1.0044 1.0169 0.9899 1.0836
dispersion: -0.043259398 hartree
energy: -2251.875975823575 hartree
dipole: -35.466274709 38.256899037 2.790624328 7.586469923 -7.890831269 -0.304361346 -52.150885355 55.413988183 3.263102828
dipolemethod: SCF
magnitude: 4.304423311 au
magnitude: 10.940974563 debye
