program: Orca
programVersion: 6.0.1
elementType: Rh C C C C C C H H H C H H H C H H H C H H H C H H H H B C C C C C C C C C C C C F F F F F F F F F F
elementType: Rh
charge: 0
multiplicity: 1
keywords: r2scan-3c OPT FREQ
frequency: 0.00 0.00 0.00 0.00 0.00 0.00 23.07 25.64 39.32 47.64 53.22 67.32 93.47 105.69 115.22 118.28 121.66 129.52 141.71 144.88 148.59 151.24 154.80 157.59 163.27 171.16 175.36 190.54 194.34 205.50 218.83 221.03 230.75 265.82 277.46 281.12 283.20 284.96 298.60 301.25 304.74 307.38 311.88 319.74 324.11 332.23 357.60 364.04 379.24 385.09 398.37 400.70 419.86 439.22 455.70 457.02 469.17 484.27 526.29 540.70 545.51 554.90 573.92 585.17 587.09 608.85 615.73 623.57 628.63 633.13 637.44 638.92 653.22 694.07 749.66 768.80 797.79 799.99 832.82 895.69 938.04 949.24 954.91 977.68 982.24 1033.07 1036.86 1039.48 1048.46 1051.09 1061.46 1086.35 1087.70 1090.12 1115.50 1119.56 1134.91 1160.48 1172.15 1177.07 1272.62 1290.25 1306.91 1339.21 1345.40 1358.21 1369.90 1390.03 1393.69 1406.24 1407.69 1409.00 1410.07 1415.14 1421.76 1455.24 1459.94 1460.94 1466.81 1467.64 1475.03 1478.31 1482.09 1483.86 1484.69 1490.31 1493.53 1524.58 1529.95 1560.69 1589.65 1634.18 1669.06 1688.15 2594.72 3004.99 3005.40 3005.56 3006.17 3007.64 3072.77 3079.19 3083.18 3087.13 3088.40 3118.99 3120.27 3123.64 3124.47 3127.86
frequency: 23.07 25.64 39.32 47.64 53.22 67.32 93.47 105.69 115.22 118.28 121.66 129.52 141.71 144.88 148.59 151.24 154.80 157.59 163.27 171.16 175.36 190.54 194.34 205.50 218.83 221.03 230.75 265.82 277.46 281.12 283.20 284.96 298.60 301.25 304.74 307.38 311.88 319.74 324.11 332.23 357.60 364.04 379.24 385.09 398.37 400.70 419.86 439.22 455.70 457.02 469.17 484.27 526.29 540.70 545.51 554.90 573.92 585.17 587.09 608.85 615.73 623.57 628.63 633.13 637.44 638.92 653.22 694.07 749.66 768.80 797.79 799.99 832.82 895.69 938.04 949.24 954.91 977.68 982.24 1033.07 1036.86 1039.48 1048.46 1051.09 1061.46 1086.35 1087.70 1090.12 1115.50 1119.56 1134.91 1160.48 1172.15 1177.07 1272.62 1290.25 1306.91 1339.21 1345.40 1358.21 1369.90 1390.03 1393.69 1406.24 1407.69 1409.00 1410.07 1415.14 1421.76 1455.24 1459.94 1460.94 1466.81 1467.64 1475.03 1478.31 1482.09 1483.86 1484.69 1490.31 1493.53 1524.58 1529.95 1560.69 1589.65 1634.18 1669.06 1688.15 2594.72 3004.99 3005.40 3005.56 3006.17 3007.64 3072.77 3079.19 3083.18 3087.13 3088.40 3118.99 3120.27 3123.64 3124.47 3127.86
formula: C22H16BF10Rh
InChI: InChI=1/C12HBF10.C10H15.Rh/c14-3-1(4(15)8(19)11(22)7(3)18)13-2-5(16)9(20)12(23)10(21)6(2)17;1-6-7(2)9(4)10(5)8(6)3;/h13H;1-5H3;/rC22H16BF10Rh/c1-16-17(2)19(4)20(5)18(16,3)34(16,17,19,20)21(14(31)12(29)13(30)15(32)22(21,34)33)23(34)6-7(24)9(26)11(28)10(27)8(6)25/h23H,1-5H3
50 atoms
Rh -0.746814 -0.717276 -0.167114
C  -1.555349 -1.663759 -1.999281
C  -2.599291 -1.105354 -1.15014
C  -0.89448 -2.645752 -1.22954
C  -2.682651 -1.899066 0.077458
C  -1.609016 -2.799286 0.05647
C  -1.283219 -1.261988 -3.408882
H  -1.416291 -0.186022 -3.546581
H  -0.260911 -1.506404 -3.705822
H  -1.969398 -1.778792 -4.092946
C  -3.634224 -0.135594 -1.600774
H  -3.229008 0.601722 -2.298111
H  -4.435285 -0.681119 -2.118172
H  -4.088232 0.3950 -0.760477
C  -3.717905 -1.713278 1.132171
H  -4.677873 -2.138627 0.81158
H  -3.431574 -2.193705 2.070112
H  -3.888591 -0.651883 1.341256
C  -1.22388 -3.785042 1.10636
H  -1.4955 -4.802994 0.797544
H  -0.143593 -3.777423 1.281992
H  -1.719811 -3.574182 2.05594
C  0.27006 -3.47801 -1.64722
H  -0.068596 -4.451815 -2.025238
H  0.84392 -2.9890 -2.437773
H  0.94544 -3.671502 -0.808896
H  0.552968 1.124943 -2.21135
B  0.61276 0.886708 -1.041121
C  -0.51352 1.459469 -0.15024
C  -1.581219 2.244226 -0.687439
C  -0.722326 0.973047 1.19657
C  -2.68716 2.582217 0.031148
C  -1.900035 1.321292 1.928518
C  -2.86747 2.08088 1.348698
C  2.067365 0.50019 -0.507143
C  3.178026 1.239902 -0.915084
C  2.360302 -0.568687 0.318861
C  4.474075 0.945935 -0.508965
C  3.627655 -0.911636 0.75527
C  4.701215 -0.139186 0.32993
F  3.011317 2.302325 -1.716547
F  1.327003 -1.372227 0.742493
F  3.829912 -1.96853 1.551065
F  5.50679 1.692366 -0.91271
F  5.941768 -0.443445 0.716701
F  -1.481659 2.707937 -1.944478
F  0.376833 0.769541 2.000676
F  -2.049988 0.855823 3.175386
F  -4.019277 2.345416 1.979306
F  -3.66044 3.343272 -0.489493
totalener: -1981.67544216158512 hartree
nucrepener: 4321.66376436374230 hartree
electener: -6303.33920652532743 hartree
twoeener: 5075.40579223260193 hartree
kineticenergy: 1905.03723357090939 hartree
exchangeener: -236.249993479166 hartree
correlationener: -8.883697226012 hartree
xcener: -245.133690705179 hartree
dispersion: -0.029427193 hartree
dispersion: -0.029436101 hartree
dispersion: -0.029478827 hartree
dispersion: -0.029526237 hartree
dispersion: -0.029575608 hartree
dispersion: -0.029603304 hartree
dispersion: -0.029605440 hartree
dispersion: -0.029597478 hartree
dispersion: -0.029589344 hartree
dispersion: -0.029585902 hartree
dispersion: -0.029587292 hartree
dispersion: -0.029592893 hartree
dispersion: -0.029602180 hartree
dispersion: -0.029614832 hartree
dispersion: -0.029626711 hartree
dispersion: -0.029630872 hartree
dispersion: -0.029625600 hartree
dispersion: -0.029609615 hartree
dispersion: -0.029588150 hartree
dispersion: -0.029571275 hartree
dispersion: -0.029564785 hartree
dispersion: -0.029575866 hartree
dispersion: -0.029599681 hartree
dispersion: -0.029606760 hartree
dispersion: -0.029610296 hartree
dispersion: -0.029610330 hartree
dispersion: -0.029610275 hartree
dispersion: -0.029610943 hartree
dispersion: -0.029612369 hartree
dispersion: -0.029613737 hartree
dispersion: -0.029614712 hartree
dispersion: -0.029615238 hartree
energy: -667.9408 -667.4537 -667.4475 -667.4216 -667.2997 -667.2858 -667.2646 -667.0315 -666.9616 -666.7001 -276.2192 -276.1537 -276.1377 -276.1345 -276.0693 -276.0345 -275.9799 -275.9652 -275.9497 -275.8813 -274.7703 -274.5196 -274.5062 -274.4144 -274.3851 -273.8818 -273.6911 -273.6801 -273.6467 -273.6304 -273.6175 -273.5273 -179.6701 -87.2632 -54.1121 -53.5142 -53.0762 -33.4627 -33.2941 -33.2843 -33.0336 -33.0147 -32.8700 -32.8308 -32.5762 -32.5583 -32.1612 -24.3213 -23.5292 -23.2848 -21.2210 -21.1843 -20.5528 -20.3284 -20.2674 -20.1562 -19.4760 -19.4463 -19.2323 -17.4654 -17.1880 -17.0830 -17.0585 -16.9629 -16.7689 -15.4581 -15.2104 -15.0296 -14.9450 -14.8019 -14.7399 -14.0960 -14.0624 -14.0125 -13.8957 -13.8126 -13.5613 -13.4118 -13.2939 -13.1779 -12.8871 -12.7891 -12.6648 -12.5988 -12.3684 -12.3360 -12.2096 -11.9747 -11.7590 -11.6356 -11.5836 -11.5369 -11.4850 -11.4629 -11.4524 -11.3426 -11.2727 -10.9266 -10.8618 -10.8111 -10.8024 -10.7679 -10.7071 -10.6902 -10.5809 -10.4784 -10.3402 -10.2533 -10.1466 -10.1065 -10.0861 -9.5658 -9.4795 -9.2804 -9.2692 -9.2301 -9.1903 -9.0547 -8.7020 -8.2200 -7.8481 -7.6690 -7.0314 -6.8223 -6.5788 -6.3735 -6.3345 -6.2560 -5.8846 -5.0283 -3.2374 -2.1176 -1.5980 -1.1926 -1.0054 -0.8681 -0.4314 -0.1809 0.0666 0.1295 0.4526 electronvolt
chargesum: 0.0000000
charge: -0.363691 0.038933 0.287185 0.221707 0.078270 0.152074 -0.589295 0.174824 0.157717 0.165555 -0.527180 0.185609 0.173188 0.173020 -0.591129 0.169130 0.153934 0.169521 -0.559541 0.171125 0.167444 0.157055 -0.557110 0.171379 0.165003 0.164953 0.028081 -0.021884 0.194395 0.032893 0.352761 0.120665 0.112163 0.135097 -0.011089 0.237658 0.340466 0.097564 0.030332 0.174474 -0.196164 -0.239136 -0.184000 -0.178026 -0.180033 -0.202735 -0.194171 -0.187592 -0.185585 -0.185813
charge: -0.291097 -0.041767 -0.013843 -0.045308 -0.049523 -0.044130 -0.359149 0.177477 0.171579 0.167133 -0.353916 0.180921 0.176344 0.178762 -0.360978 0.169006 0.170903 0.176401 -0.363176 0.170955 0.174584 0.170768 -0.362828 0.171977 0.173637 0.173599 0.114592 -0.123806 -0.077697 0.241301 0.226130 0.210629 0.233293 0.215285 -0.094687 0.246808 0.236751 0.227936 0.226134 0.235135 -0.247166 -0.223520 -0.244329 -0.240621 -0.236791 -0.250631 -0.261738 -0.240451 -0.244686 -0.246202
qa: -0.3637 0.0389 0.2872 0.2217 0.0783 0.1521 -0.5893 0.1748 0.1577 0.1656 -0.5272 0.1856 0.1732 0.1730 -0.5911 0.1691 0.1539 0.1695 -0.5595 0.1711 0.1674 0.1571 -0.5571 0.1714 0.1650 0.1650 0.0281 -0.0219 0.1944 0.0329 0.3528 0.1207 0.1122 0.1351 -0.0111 0.2377 0.3405 0.0976 0.0303 0.1745 -0.1962 -0.2391 -0.1840 -0.1780 -0.1800 -0.2027 -0.1942 -0.1876 -0.1856 -0.1858
va: 4.2496 3.8837 3.3961 3.5582 3.8501 3.6058 3.7879 0.9577 0.9640 0.9547 3.6112 0.9513 0.9554 0.9575 3.7163 0.9537 0.9657 0.9609 3.7306 0.9545 0.9584 0.9654 3.6915 0.9549 0.9623 0.9604 0.9946 3.6765 3.6523 3.9243 3.5375 3.5834 3.6626 3.6312 3.5505 3.6496 3.5575 3.7114 3.6778 3.6119 1.0177 0.9674 1.0272 1.0317 1.0374 1.0174 0.9025 1.0308 1.0205 1.0149
dispersion: -0.029615849 hartree
energy: -1981.687069718595 hartree
dipole: 9.361397013 -10.958559332 -1.597162319 7.505409747 -10.054334028 -2.548924281 -9.154868753 8.435498179 -0.719370574
dipolemethod: SCF
magnitude: 3.092803984 au
magnitude: 7.861282982 debye
temp: 298.15 k
press: 1.00 atm
zeropoint: 0.33330004 hartree
thermalvibcorrection: 0.03118116 hartree
thermalrotcorrection: 0.00141627 hartree
thermaltrasncorrection: 0.00141627 hartree
thermaltotal: -1981.31975597 hartree
thermalcorr: 0.03401371 hartree
nonthermalcorr: 0.33330004 hartree
totalcorr: 0.36731375 hartree
thermalcorrenthalpy: 0.00094421 hartree
totalenthalpy: -1981.31881176 hartree
vibrat: 0.05538043 hartree
rotat: 0.01746427 hartree
transl: 0.02137075 hartree
total: 0.09421545 hartree
totalentropycorr: -0.09421545 hartree
gibbsenthalpy: -1981.41302721 hartree
gibbsminuselec: 0.27404251 hartree
