program: Orca
programVersion: 6.0.1
elementType: H H
charge: 0
multiplicity: 1
keywords: r2scan0 d4 ma-def2-qzvp SP TIGHTSCF SMD(toluene)
formula: H2
InChI: InChI=1/2H
2 atoms
H  -0.78511 0.171362 -1.063266
H  -0.849855 -0.087518 -0.37144
elementType: H
totalener: -1.17087400473784 hartree
nucrepener: 0.71364966717508 hartree
electener: -1.88490055197052 hartree
oneelecener: -2.50717556383716 hartree
twoeener: 0.62227501186664 hartree
cpcmener: -0.00031649164995 hartree
kineticenergy: 1.13964842488377 hartree
exchangeener: -0.497144239002 hartree
energy: -12.1595 2.4649 4.8287 10.4675 10.6033 10.6035 19.6438 20.0542 20.0543 25.8592 26.8392 41.1481 electronvolt
chargesum: 0.0000000
charge: -0.000001 0.000001
charge: -0.000000 0.000000
qa: -0.0000 0.0000
va: 1.0000 1.0000
dispersion: -0.000019878 hartree
energy: -1.170893882387 hartree
dipole: 0.000000000 -0.000000006 -0.000000006 -0.000000000 0.000000006 0.000000006 0.000000000 -0.000000001 -0.000000001
dipolemethod: SCF
magnitude: 0.000000009 au
magnitude: 0.000000022 debye
