program: Orca
programVersion: 6.0.1
elementType: C C C C C C C C C Rh C C C C F F F F B C C C C C C F F F F F C C C C C C C C C C F H H H H H H H H H H H H H H H H H H H H H H H H
elementType: Rh
charge: 0
multiplicity: 1
keywords: r2scan0 d4 ma-def2-qzvp SP TIGHTSCF NBO AIM SMD(toluene)
formula: C29H24BF10Rh
InChI: InChI=1/C19H8BF10.C10H15.Rh.H/c21-10-5-9(12(22)16(26)13(10)23)20(30,8-4-6-1-2-7(8)3-6)11-14(24)17(27)19(29)18(28)15(11)25;1-6-7(2)9(4)10(5)8(6)3;;/h1-2,4,6-8H,3H2;1-5H3;;/rC29H24BF10Rh/c1-9-25(2)27(4)28(5)26(9,3)41(25,27,28)23-13(16(33)19(36)21(38)22(23)39)30(40,12-14(31)17(34)20(37)18(35)15(12)32)29(41,42-41)11-7-6-10(8-11)24(29)41/h6-7,10-11,24,41H,8H2,1-5H3
65 atoms
C  -0.922232 -0.06944 2.210346
C  -1.103042 1.270743 -0.141727
C  -1.649354 0.09578 -0.689851
C  -0.362576 -1.07393 1.254796
C  2.388449 1.250689 -0.108062
C  2.869211 0.977553 1.252496
C  1.76455 2.524111 -0.109002
C  2.440631 2.014941 2.086333
C  1.687126 2.9645 1.261844
Rh 0.505848 1.112199 1.128214
C  -1.650063 2.497903 -0.472351
C  -2.618653 0.243411 -1.672782
C  -3.12192 1.478361 -2.061296
C  -2.640949 2.619714 -1.438617
F  -1.24907 3.646688 0.132184
F  -3.130856 3.824258 -1.767804
F  -4.074839 1.582004 -2.997037
F  -3.158984 -0.843004 -2.262519
B  -1.205628 -1.385213 -0.166685
C  -2.430823 -2.41684 0.159441
C  -3.670825 -1.998739 0.636756
C  -2.293571 -3.799465 0.038668
C  -4.720508 -2.857771 0.930078
C  -3.316895 -4.698547 0.320907
C  -4.541315 -4.224644 0.768145
F  -1.127072 -4.347569 -0.348286
F  -3.90871 -0.684037 0.855615
F  -5.893698 -2.389339 1.376606
F  -5.534479 -5.073598 1.048859
F  -3.130549 -6.017666 0.179609
C  0.106242 -2.223271 2.223653
C  -0.717401 -0.659278 3.624041
C  -1.045692 -2.136174 3.262706
C  0.768726 -0.780903 3.894642
C  1.252039 -1.718002 3.071886
C  2.676814 0.427112 -1.319053
C  3.78344 -0.147769 1.588048
C  1.349093 3.263193 -1.334972
C  1.276549 4.315999 1.739439
C  2.763793 2.230612 3.52616
F  -0.279603 -1.958711 -1.080457
H  0.558094 -0.71391 0.639233
H  3.598806 0.774768 -1.80442
H  2.802734 -0.629581 -1.07284
H  1.863158 0.498836 -2.045357
H  2.246298 3.544998 -1.900194
H  0.726858 2.644507 -1.987822
H  0.794795 4.171209 -1.099274
H  2.167606 4.954908 1.807845
H  0.566213 4.790635 1.064412
H  0.825972 4.270063 2.733669
H  3.505041 3.033376 3.632104
H  1.878691 2.526085 4.096654
H  3.1784 1.331009 3.98451
H  4.783158 0.076034 1.192039
H  3.872569 -0.297109 2.664839
H  3.459864 -1.086606 1.13143
H  -0.479928 1.731174 2.184044
H  -1.321264 -0.181869 4.397617
H  -0.908243 -2.813801 4.110831
H  -2.037283 -2.272158 2.819951
H  1.317703 -0.15761 4.590377
H  2.280531 -2.037812 2.96566
H  0.257947 -3.168843 1.700265
H  -1.93089 0.283337 2.010529
elementType: C Rh F B H
totalener: -2253.00696236649128 hartree
nucrepener: 5768.94202009349738 hartree
electener: -8021.91903235773680 hartree
twoeener: 6612.09389959082728 hartree
cpcmener: -0.02266700750638 hartree
kineticenergy: 2173.44494123620734 hartree
exchangeener: -206.564946075423 hartree
energy: -679.6376 -679.5087 -679.4792 -679.4564 -679.3460 -679.2118 -679.1959 -679.0680 -678.9423 -676.7580 -284.2935 -284.1130 -284.0920 -284.0164 -284.0124 -284.0057 -283.8920 -283.7436 -283.6591 -283.0345 -282.8663 -282.8334 -282.7742 -282.7496 -282.6260 -281.9056 -281.8927 -281.8827 -281.8736 -281.6974 -281.6767 -281.5568 -281.5462 -281.4977 -281.4726 -281.4619 -281.4277 -281.3736 -280.9919 -186.9687 -92.3509 -57.9770 -57.6275 -57.2787 -36.2388 -36.0197 -35.9577 -35.7832 -35.7072 -35.4630 -35.4080 -35.3904 -35.2386 -32.7084 -26.7010 -26.0116 -25.5028 -25.1599 -23.3643 -23.2360 -22.5103 -22.1752 -22.0784 -21.7605 -21.7546 -21.4094 -21.3114 -21.1518 -21.0832 -20.4744 -19.0144 -18.8140 -18.7398 -18.5125 -18.4623 -18.3391 -17.3584 -16.9069 -16.7758 -16.5592 -16.5011 -16.4020 -15.9764 -15.9075 -15.6564 -15.6154 -15.4228 -15.3922 -15.2885 -15.2126 -15.0931 -14.9346 -14.7054 -14.4441 -14.4276 -14.3318 -14.2037 -14.1275 -14.0313 -13.9118 -13.8632 -13.6799 -13.5161 -13.3991 -13.3480 -13.1842 -12.9165 -12.8857 -12.8685 -12.8111 -12.7828 -12.6969 -12.6182 -12.5742 -12.5362 -12.3916 -12.1733 -12.1591 -12.0140 -11.9049 -11.8513 -11.8315 -11.7492 -11.6963 -11.6512 -11.5117 -11.4747 -11.2905 -11.2084 -11.0366 -10.9422 -10.9165 -10.8621 -10.6438 -10.5559 -10.4380 -10.3775 -10.3539 -10.1674 -10.1241 -9.9810 -9.7488 -9.6228 -9.0181 -8.8315 -8.6261 -8.5648 -8.4303 -7.6858 -7.4403 -7.1202 -7.0135 -6.9651 -6.8417 -6.7205 -2.5777 -1.2028 -0.4564 -0.1982 -0.1120 0.0044 0.0211 0.0244 0.1240 0.2022 0.2716 electronvolt
chargesum: 0.0000000
charge: 0.091118 -0.305251 -0.253632 0.339907 -0.207078 -0.057317 0.076688 -0.003772 -0.130006 1.494585 0.085077 0.244602 0.126287 0.250303 -0.310350 -0.276413 -0.277976 -0.300201 0.533340 -0.159923 0.492101 0.249994 -0.093662 0.039995 0.365013 -0.286843 -0.294727 -0.276279 -0.254538 -0.268106 0.060311 0.006227 -0.002411 -0.124145 -0.174911 -0.173989 -0.170691 -0.179933 -0.153736 -0.177500 -0.462351 -0.209837 0.062018 0.052259 0.063874 0.049074 0.071402 0.057910 0.056932 0.049616 0.048833 0.051707 0.049827 0.038113 0.061943 0.039377 0.044064 0.027041 0.034435 0.042347 0.021891 0.042131 0.036149 0.054360 0.074728
charge: 0.034127 -0.110024 -0.001201 0.029942 -0.148479 -0.138359 -0.150837 -0.153106 -0.152979 0.696749 -0.437553 -0.367575 -0.382160 -0.387340 0.275870 0.346934 0.349975 0.336738 -1.149796 0.046485 -0.368599 -0.363265 -0.382360 -0.379036 -0.379586 0.338167 0.325048 0.353477 0.361861 0.352510 -0.005044 -0.042627 0.150894 0.068876 0.075295 0.238371 0.231407 0.249797 0.239091 0.225071 0.347152 0.042791 -0.011076 -0.010833 -0.004189 -0.008559 -0.003141 -0.010906 -0.008963 -0.016789 -0.011792 -0.012832 -0.012250 -0.019021 -0.006829 -0.016092 -0.010378 0.005899 -0.007686 -0.004595 0.002691 -0.030191 -0.031387 0.008375 0.003845
qa: 0.0911 -0.3053 -0.2536 0.3399 -0.2071 -0.0573 0.0767 -0.0038 -0.1300 1.4946 0.0851 0.2446 0.1263 0.2503 -0.3103 -0.2764 -0.2780 -0.3002 0.5333 -0.1599 0.4921 0.2500 -0.0937 0.0400 0.3650 -0.2868 -0.2947 -0.2763 -0.2545 -0.2681 0.0603 0.0062 -0.0024 -0.1241 -0.1749 -0.1740 -0.1707 -0.1799 -0.1537 -0.1775 -0.4624 -0.2098 0.0620 0.0523 0.0639 0.0491 0.0714 0.0579 0.0569 0.0496 0.0488 0.0517 0.0498 0.0381 0.0619 0.0394 0.0441 0.0270 0.0344 0.0423 0.0219 0.0421 0.0361 0.0544 0.0747
va: 3.8120 3.4683 2.2974 2.6480 3.4290 3.5018 3.2806 3.3700 3.4393 3.4368 3.2622 3.1177 3.4674 3.4241 0.8035 0.8742 0.8788 0.8498 2.4887 2.6343 3.0666 3.1683 3.7995 3.6473 3.3791 0.8644 0.7923 0.9057 0.8946 0.9006 3.3788 3.5433 3.5954 3.7925 3.7517 3.7473 3.7412 3.7498 3.6740 3.7512 0.3367 1.0506 0.9928 0.9909 0.9880 0.9942 0.9885 0.9895 0.9983 1.0050 0.9910 1.0018 0.9860 0.9988 0.9998 0.9937 0.9848 1.1125 1.0009 0.9988 1.0636 1.0234 1.0266 0.9818 1.0076
dispersion: -0.044928092 hartree
energy: -2253.051890458936 hartree
dipole: -22.570412277 28.083749779 5.513337501 -49.241469627 52.189468678 2.947999052 -5.724328186 8.702138819 2.977810634
dipolemethod: SCF
magnitude: 6.924950901 au
magnitude: 17.601826351 debye
