program: Orca
programVersion: 6.1.0
elementType: Rh C C C C C C H H H C H H H C H H H C H H H C H H H B C C C C C C C C C C C C F F F F F F F F F F H
elementType: Rh
charge: 0
multiplicity: 1
keywords: r2scan0 D4 ma-def2-qzvp SP TIGHTSCF SMD(toluene)
formula: C22H16BF10Rh
InChI: InChI=1/C12HBF9.C10H15.FH.Rh/c14-3-1-2(5(15)9(19)6(3)16)13-4-7(17)10(20)12(22)11(21)8(4)18;1-6-7(2)9(4)10(5)8(6)3;;/h13H;1-5H3;1H;/q;;;+1/p-1/rC22H16BF10Rh/c1-17-18(2)20(4)21(5)19(17,3)34(17,18,20,21,33)16-14(31)12(29)13(30)15(32)22(16,34)23(34)6-7(24)9(26)11(28)10(27)8(6)25/h23H,1-5H3
50 atoms
Rh -1.496513 0.788372 -0.517012
C  -2.897737 -0.790575 -1.36677
C  -2.061658 -0.148923 -2.369084
C  -3.643627 0.222868 -0.734713
C  -2.431043 1.250598 -2.461309
C  -3.353491 1.503007 -1.408714
C  -2.92186 -2.259741 -1.109131
H  -3.562592 -2.508437 -0.262812
H  -3.30425 -2.784846 -1.993458
H  -1.922784 -2.649829 -0.893786
C  -1.129547 -0.872985 -3.279098
H  -0.349399 -0.212166 -3.665051
H  -0.64717 -1.70795 -2.76397
H  -1.679098 -1.281365 -4.137743
C  -1.912014 2.226019 -3.462863
H  -0.868392 2.019858 -3.715509
H  -2.494884 2.169718 -4.391331
H  -1.967771 3.250944 -3.089794
C  -4.003175 2.799335 -1.067584
H  -4.090722 2.920256 0.015258
H  -3.429454 3.645833 -1.451034
H  -5.013691 2.846692 -1.494831
C  -4.587902 0.082923 0.410291
H  -4.506028 -0.899261 0.879095
H  -4.385704 0.838143 1.177133
H  -5.623508 0.223584 0.075526
B  -0.150814 -0.532054 0.873442
C  0.648186 0.579825 0.09266
C  0.113109 1.849781 -0.212713
C  1.942913 0.343733 -0.428456
C  0.830199 2.914896 -0.729717
C  2.698446 1.379254 -0.93133
C  2.135598 2.664339 -1.094188
C  -0.746746 -0.313182 2.30044
C  -0.26866 0.633734 3.212888
C  -1.809283 -1.098395 2.750413
C  -0.822304 0.806335 4.472775
C  -2.405046 -0.938963 3.990397
C  -1.902753 0.022214 4.859703
F  -2.327856 -2.040805 1.937055
F  -3.450369 -1.692233 4.358085
F  -2.454916 0.188415 6.062826
F  -0.330488 1.713938 5.322779
F  0.802499 1.378368 2.914522
F  2.535807 -0.844566 -0.259828
F  3.983794 1.203378 -1.256131
F  2.857931 3.594654 -1.718376
F  0.242364 4.073177 -1.056481
F  -1.221749 2.163703 1.151836
H  -0.005268 -1.65916 0.49727
elementType: Rh C H B F
totalener: -1981.49056863495662 hartree
nucrepener: 4294.14711877480750 hartree
electener: -6275.61903555850495 hartree
twoeener: 5048.59011374793317 hartree
cpcmener: -0.01494622275563 hartree
kineticenergy: 1903.65579927104955 hartree
exchangeener: -177.089026261839 hartree
energy: -680.0935 -679.8651 -679.8387 -679.7372 -679.7368 -679.7362 -679.6363 -679.5570 -679.3577 -676.5792 -285.0237 -284.8080 -284.6025 -284.5785 -284.5163 -284.3776 -284.3603 -284.3532 -284.3016 -283.6838 -282.7557 -282.6546 -282.6022 -282.5955 -282.4633 -282.4316 -281.8164 -281.5397 -281.5153 -281.4403 -281.4333 -281.3890 -187.1042 -91.7761 -57.6194 -56.9247 -56.7336 -36.6765 -36.4716 -36.3360 -36.1871 -36.0690 -36.0299 -35.9692 -35.7886 -35.6863 -31.3937 -26.5066 -26.0534 -25.7735 -23.1642 -23.1096 -22.9241 -22.6466 -22.5091 -22.3796 -21.2485 -21.1901 -20.9944 -19.5606 -19.2277 -19.0812 -19.0014 -18.6674 -18.3894 -17.2697 -17.1531 -16.9283 -16.8616 -16.7568 -16.5697 -15.9126 -15.6715 -15.5749 -15.4804 -15.4613 -15.3320 -15.2288 -15.1590 -14.8175 -14.6932 -14.5059 -14.4211 -14.1536 -14.0917 -13.9519 -13.7974 -13.7141 -13.6062 -13.5562 -13.2519 -13.0819 -13.0302 -12.9747 -12.8716 -12.7652 -12.7301 -12.6339 -12.5235 -12.3299 -12.0215 -11.9364 -11.8963 -11.8341 -11.7751 -11.7331 -11.6437 -11.6013 -11.3503 -11.2987 -11.1965 -11.1207 -10.9262 -10.8142 -10.4382 -10.2855 -10.2593 -10.2332 -10.1030 -9.8613 -9.3879 -8.5767 -8.3575 -8.0638 -7.9778 -7.8622 -7.4764 -7.3048 -7.2572 -6.0631 -2.8229 -1.9847 -1.0872 -0.5810 -0.2135 -0.0741 -0.0135 0.0495 0.1370 0.2935 0.4970 electronvolt
chargesum: -0.0000000
charge: 0.780859 -0.020146 -0.158567 -0.026410 0.081394 -0.106491 -0.150860 0.048269 0.048185 0.051328 -0.142493 0.045834 0.052347 0.062359 -0.162404 0.044771 0.056918 0.053144 -0.144376 0.048723 0.048758 0.056880 -0.148949 0.046728 0.058854 0.054213 0.270160 -0.082531 0.440570 0.137748 0.063602 0.165767 0.194547 -0.134071 0.493709 0.213686 0.012929 0.048871 0.421577 -0.259702 -0.267480 -0.241718 -0.262818 -0.244262 -0.280527 -0.256571 -0.223734 -0.249163 -0.522703 -0.016755
charge: 0.649092 -0.149868 -0.161237 -0.147825 -0.154923 -0.150777 0.233883 -0.014818 -0.015003 -0.008914 0.237051 -0.012810 -0.008710 -0.010624 0.237593 -0.012240 -0.014646 -0.013093 0.238409 -0.008734 -0.014046 -0.013879 0.240029 -0.011854 -0.004347 -0.013022 -0.390177 -0.046534 -0.148736 -0.355023 -0.398564 -0.372685 -0.359364 0.007362 -0.359168 -0.363451 -0.374060 -0.380878 -0.371970 0.312004 0.353457 0.370299 0.361066 0.358985 0.356792 0.360644 0.378751 0.348902 -0.247680 0.065344
qa: 0.7809 -0.0201 -0.1586 -0.0264 0.0814 -0.1065 -0.1509 0.0483 0.0482 0.0513 -0.1425 0.0458 0.0523 0.0624 -0.1624 0.0448 0.0569 0.0531 -0.1444 0.0487 0.0488 0.0569 -0.1489 0.0467 0.0589 0.0542 0.2702 -0.0825 0.4406 0.1377 0.0636 0.1658 0.1945 -0.1341 0.4937 0.2137 0.0129 0.0489 0.4216 -0.2597 -0.2675 -0.2417 -0.2628 -0.2443 -0.2805 -0.2566 -0.2237 -0.2492 -0.5227 -0.0168
va: 4.3984 3.4444 3.5503 3.3881 3.2937 3.4401 3.7552 0.9964 0.9940 0.9912 3.7691 0.9938 0.9910 0.9974 3.8112 0.9906 0.9994 0.9932 3.8030 0.9999 1.0016 0.9967 3.7890 0.9998 0.9903 0.9926 2.7736 2.7539 3.1265 3.3697 3.4758 3.5388 3.6954 3.3272 3.0458 3.4361 3.6686 3.6727 3.3576 0.8291 0.9065 0.9116 0.9148 0.8254 0.9262 0.9067 0.9274 0.8875 0.5382 0.9776
dispersion: -0.031284081 hartree
energy: -1981.521852716000 hartree
dipole: 1.174875527 -3.323169550 -2.148294023 -12.859714507 12.098801280 -0.760913227 21.872304425 -25.112715711 -3.240411286
dipolemethod: SCF
magnitude: 3.961618540 au
magnitude: 10.069634081 debye
