program: Gaussian 09
title: Title Card Required
version: AM64L-G09RevD.01
frameworkgroup: C1[X(C14H8O2)]
method: RM062X
basis: Gen
operation: Freq
keyword: #p
keyword: freq=noraman
keyword: m062x
keyword: gen
keyword: integral=grid=ultrafine
keyword: scrf(solvent=acetonitrile,SMD)
title: #p freq=noraman m062x gen integral=grid=ultrafine scrf(solvent=acetoni
basis: NPDir=0 NMtPBC= 1 NCelOv= 1 NCel= 1 NClECP= 1 NCelD= 1
basis: NCelK= 1 NCelE2= 1 NClLst= 1 CellRange= 0.0.
basis: One-electron integrals computed using PRISM.
basis: NBasis= 272 RedAO= T EigKep= 2.27D-04 NBF= 272
basis: NBsUse= 272 1.00D-06 EigRej= -1.00D+00 NBFU= 272
converged: YES YES YES YES
title: Mulliken charges:
elementType: C C C C C C C C C C C H C C C H H H H H H H O O
charge: -0.135064 -0.162083 0.005112 0.005113 -0.162084 -0.135064 0.442457 0.442457 0.005112 0.005114 -0.162085 0.188273 -0.135063 -0.135064 -0.162083 0.172869 0.188272 0.188273 0.172870 0.172870 0.172869 0.188272 -0.580672 -0.580672
chargesum: 0.00000
title: Mulliken charges with hydrogens summed into heavy atoms:
elementType: C C C C C C C C C C C C C C O O
charge: 0.037805 0.026189 0.005112 0.005113 0.026189 0.037806 0.442457 0.442457 0.005112 0.005114 0.026188 0.037806 0.037805 0.026189 -0.580672 -0.580672
polarizability: 3.06076413e+02 -3.17575532e-04 2.61951282e+02 2.50089819e-05 -5.71447933e-04 6.75753241e+01
1716.lowfreq: -0.0007 -0.0005 0.0006 7.9290 16.2322 18.4029 43.2785 110.8887 116.0691
frequency: 43.2785 110.8887 116.0346 158.4275 229.9514 234.3994 308.0568 366.1297 400.5500 412.5457 422.8839 428.4070 447.5323 485.2012 493.8286 623.4132 634.3658 673.1090 690.7990 695.2349 722.2004 728.8383 790.3842 804.3018 814.5190 841.0358 926.7939 932.9073 936.1214 963.6364 1012.7432 1015.7977 1043.3002 1043.8485 1072.3986 1077.6489 1117.2753 1120.2531 1168.9266 1170.9706 1191.5164 1215.6580 1241.3785 1290.8177 1327.6693 1343.7283 1371.6396 1375.5956 1498.5146 1511.4561 1533.1658 1536.8183 1660.4103 1673.0861 1675.1728 1680.3865 1790.4840 1793.4269 3233.5132 3233.5703 3242.4564 3242.6386 3249.1243 3249.4019 3253.4115 3253.8195
redmass: 7.6251 3.9210 5.5099 6.9765 5.1091 4.8889 6.9277 7.2532 12.3693 3.2724 8.3936 5.0419 3.2002 11.6908 4.0291 6.7411 6.8937 4.4413 7.2612 6.1590 1.9425 4.2767 1.2141 6.3095 4.6039 2.1890 1.3304 6.8339 1.4726 6.7281 1.3686 1.4020 1.3409 1.3433 2.0980 1.7205 2.5082 1.8006 1.1179 1.0925 2.0778 2.7693 1.6682 1.5206 5.1375 2.2738 6.8255 8.3611 2.5845 3.0781 3.0958 2.8870 7.2928 7.9791 6.6133 6.5202 12.6030 12.7168 1.0878 1.0878 1.0908 1.0910 1.0943 1.0945 1.0986 1.0987
irintensity: 13.8423 0.0000 0.0000 3.3595 0.0000 1.6463 0.0000 0.0000 60.5165 0.2868 0.0000 0.0000 0.0000 0.0000 0.0000 1.8640 22.3255 0.0000 0.0000 0.0000 198.5591 0.0000 0.0000 1.0625 0.0000 30.6864 0.0000 0.0000 0.0000 195.0699 0.0000 5.6252 0.0000 0.0000 0.0000 2.9367 0.0790 0.0000 0.0000 10.4304 28.5573 0.0000 0.0000 14.8340 1013.6788 0.0000 271.9047 0.0000 0.2445 0.0000 49.1180 0.0000 4.4638 0.0000 284.8243 0.0000 906.6703 0.0001 0.0153 3.8344 3.5994 0.0004 0.0000 0.4021 24.9249 0.0007
temp: 298.150 k
press: 1.00000 atm
elementType: 6 6 6 6 6 6 6 6 6 6 6 1 6 6 6 1 1 1 1 1 1 1 8 8
symmnumber: 1
zpe: 478194.0 jmol-1
zpe.correction: 0.182134 hartree
zpe.thermalcorrener: 0.193280 hartree
zpe.thermalcorrenthalpy: 0.194225 hartree
zpe.thermalcorrgfe: 0.144542 hartree
zpe.sumelectzpe: -688.348388 hartree
zpe.sumelectthermal: -688.337242 hartree
zpe.sumelectthermalent: -688.336297 hartree
zpe.sumelectthermalfe: -688.385980 hartree
dipole: 0.0000 0.0000 0.0020
dipole: 0.0020
quadrupole: -56.2717 -102.4187 -93.0563
quadrupole: 0.0000 0.0000 0.0016
quadrupole: 27.6439 -18.5031 -9.1408 0.0000 0.0000 0.0016
hfenergy: -688.530522 hartree
pointgroup: C01 [X(C14H8O2)]
dipole: 0.0000004 -0.0000003 0.0007964 debye
dipolederiv: 0.1626184 0.1752622 -0.000057 0.0460638 -0.1021473 -0.0000068 -0.0000833 -0.0000419 -0.1157744 -0.2621526 -0.2323352 0.000016 0.1261241 0.1226351 0.0000082 0.0000951 0.0000301 -0.1183278 -0.7582079 0.4093065 0.0000605 0.5445592 -0.1861295 -0.0000888 0.0000016 -0.0000983 -0.0202727 -0.7581941 -0.4093032 0.0000615 -0.5445582 -0.1861216 0.0000826 0.0000392 0.000027 -0.0202719 -0.2621599 0.2323311 0.0000259 -0.126126 0.1226355 0.0000161 0.0000739 -0.0000296 -0.1183288 0.1626196 -0.1752586 -0.0000646 -0.0460589 -0.1021439 0.0000025 -0.0000482 0.0000376 -0.1157736 2.5734941 -0.0000062 0.0000001 -0.0000053 2.020353 0.0004125 0.0000025 0.0002879 0.3532237 2.5734962 -0.0000053 -0.0000005 -0.0000055 2.0203535 -0.0004292 -0.0000032 -0.0003404 0.3532238 -0.7582102 0.409306 -0.0000633 0.5445591 -0.1861295 0.0000834 -0.0000447 0.0000293 -0.020273 -0.7581926 -0.4093028 -0.0000584 -0.5445575 -0.1861212 -0.0000885 0.0000038 -0.0000973 -0.0202717 -0.2621604 0.2323314 -0.0000176 -0.1261263 0.1226353 0.0000048 -0.0000961 0.0000279 -0.1183289 0.1505016 -0.0340013 -0.0000069 0.0217394 0.0181063 0.0000011 -0.0000085 -0.0000003 0.1633743 0.1626177 -0.1752579 0.0000602 -0.0460576 -0.1021434 -0.0000078 0.000088 -0.0000439 -0.1157734 0.1626188 0.1752615 0.0000619 0.0460639 -0.1021481 0.0000014 0.0000457 0.0000377 -0.1157745 -0.2621513 -0.2323347 -0.0000245 0.126124 0.1226353 0.0000128 -0.0000739 -0.0000353 -0.1183278 -0.0315982 -0.0715594 0.0000277 -0.0774536 0.0772038 0.0000132 0.0000242 0.0000199 0.1540111 0.1505017 0.0340021 0.0000072 -0.0217395 0.018106 -0.0000007 0.0000076 -0.0000012 0.163374 0.1505015 -0.0340011 0.000006 0.0217393 0.0181064 -0.0000079 -0.0000325 -0.0000189 0.1633743 -0.0315971 0.0715585 0.0000293 0.0774524 0.0772045 -0.0000162 0.0000346 -0.0000156 0.1540112 -0.0315963 0.0715583 -0.0000289 0.0774519 0.0772047 0.0000143 -0.0000263 0.0000219 0.1540113 -0.031598 -0.0715592 -0.0000281 -0.0774538 0.0772038 -0.0000151 -0.0000339 -0.0000142 0.1540112 0.1505016 0.0340019 -0.0000064 -0.0217394 0.0181061 -0.0000063 0.0000335 -0.0000165 0.163374 -1.0958264 0.0000026 -0.0000004 0.0000024 -1.8797026 0.0003199 0.0000012 0.0003729 -0.4792454 -1.095826 0.0000027 0.0000004 0.000002 -1.879702 -0.0003053 -0.0000006 -0.0001389 -0.4792453 unknown
polarizability: 306.0764129|-0.0003197|261.9512818|0.000025|-0.0005714|67.5753241 unknown
InChI: InChI=1/C14H8O2/c15-13-9-5-1-2-6-10(9)14(16)12-8-4-3-7-11(12)13/h1-8H
charge 0 multiplicity 1
24 atoms
C  -3.689834 -0.698015 0.000313
C  -2.487104 -1.39579 0.000092
C  -1.276695 -0.701709 -0.000096
C  -1.276696 0.701711 -0.000059
C  -2.487107 1.39579 0.000135
C  -3.689837 0.69801 0.000331
C  -0.000001 -1.470473 -0.000373
C  0.000001 1.470473 -0.000197
C  1.276695 0.701709 -0.000066
C  1.276696 -0.701711 -0.000091
C  2.487106 -1.39579 0.000107
H  2.472613 -2.480583 0.000081
C  3.689837 -0.698011 0.000322
C  3.689835 0.698014 0.000322
C  2.487105 1.39579 0.00012
H  -4.629431 -1.240577 0.000468
H  -2.472605 -2.480583 0.000055
H  -2.472614 2.480583 0.000155
H  -4.629434 1.240571 0.000506
H  4.629433 -1.240571 0.000488
H  4.629431 1.240577 0.000489
H  2.472606 2.480583 0.000126
O  -0.000003 2.69238 -0.000535
O  0.000003 -2.69238 -0.000406
