program: Gaussian 16
title: Title Card Required
version: EM64L-G16RevC.01
frameworkgroup: C1[X(C7H7O)]
method: UM062X
basis: Gen
operation: Freq
keyword: #p
keyword: freq=noraman
keyword: gen
keyword: integral=grid=ultrafine
keyword: m062x
keyword: scrf(SMD,solvent=acetonitrile)
title: #p freq=noraman gen integral=grid=ultrafine m062x scrf(SMD,solvent=ace
basis: NPDir=0 NMtPBC= 1 NCelOv= 1 NCel= 1 NClECP= 1 NCelD= 1
basis: NCelK= 1 NCelE2= 1 NClLst= 1 CellRange= 0.0.
basis: One-electron integrals computed using PRISM.
basis: One-electron integral symmetry used in STVInt
basis: NBasis= 151 RedAO= T EigKep= 4.71D-04 NBF= 151
basis: NBsUse= 151 1.00D-06 EigRej= -1.00D+00 NBFU= 151
converged: YES YES NO NO
polarizability: 1.43586843e+02 -3.26933440e+00 1.16008884e+02 2.88754107e+00 -4.85920776e-02 4.31912105e+01
1716.lowfreq: -23.3930 -8.3672 -0.0004 0.0004 0.0007 4.7465 95.6170 217.8886 248.5109
frequency: 95.4718 217.8855 248.5091 335.8858 426.9007 458.6878 519.5101 570.5849 622.9028 710.4568 725.0794 785.5611 810.8977 858.9206 933.5173 1000.9065 1013.8482 1022.5228 1059.2305 1108.0544 1164.0488 1170.3442 1188.8869 1207.0398 1329.3503 1335.4357 1360.4125 1482.9780 1507.4054 1543.6299 1677.1552 1687.4355 3169.2480 3224.1244 3230.3224 3238.9213 3245.3030 3249.7381 3317.7295
redmass: 3.6648 2.6772 2.1129 1.6297 3.0170 5.4027 3.2843 3.9762 6.4014 2.2011 1.3135 1.6287 4.8818 1.2478 1.4238 1.3456 5.3819 1.2747 2.0780 1.3973 1.2143 1.5990 1.3055 1.7117 5.6474 1.6235 3.5565 1.1862 2.4057 2.5285 6.6061 6.5887 1.0469 1.0864 1.0901 1.0938 1.0965 1.0975 1.1234
irintensity: 6.9797 1.2948 3.4869 13.5488 0.0772 1.9849 9.0328 9.6657 0.3687 33.0916 56.7978 90.0885 33.7122 0.3985 13.3575 0.1865 0.6446 0.4362 7.4438 14.0554 7.7974 6.3308 9.7456 48.0079 289.4671 87.4965 118.6662 17.5338 2.9452 208.3318 45.4585 70.2402 24.9022 1.5428 8.8017 13.4031 6.9895 1.5562 7.8366
temp: 298.150 k
press: 1.00000 atm
elementType: 6 6 6 6 6 6 1 1 1 1 1 8 6 1 1
symmnumber: 1
zpe: 316142.2 jmol-1
zpe.correction: 0.120412 hartree
zpe.thermalcorrener: 0.127220 hartree
zpe.thermalcorrenthalpy: 0.128165 hartree
zpe.thermalcorrgfe: 0.088846 hartree
zpe.sumelectzpe: -345.845673 hartree
zpe.sumelectthermal: -345.838865 hartree
zpe.sumelectthermalent: -345.837921 hartree
zpe.sumelectthermalfe: -345.877240 hartree
dipole: 0.4476 0.9896 0.8714
dipole: 1.3925
quadrupole: -39.3119 -41.5609 -50.1998
quadrupole: -2.2352 -1.5502 0.2024
quadrupole: 4.3790 2.1299 -6.5089 -2.2352 -1.5502 0.2024
hfenergy: -345.9660856 hartree
pointgroup: C01 [X(C7H7O1)]
dipole: 0.1760848 0.3893479 0.342823 debye
dipolederiv: -0.4091142 -0.0380789 0.0145211 0.2359894 0.010153 0.0097764 0.0043317 -0.0019985 -0.195361 0.1584186 0.054281 0.0089438 -0.0480067 0.167537 -0.0208001 0.0300167 -0.0109705 -0.1460342 -0.0436782 0.0869575 0.0165546 0.0123756 -0.2977789 0.0138362 0.0120236 0.0130879 -0.1654682 0.1142197 -0.0960812 0.0196618 0.072792 0.1743561 -0.0126921 0.0264191 -0.0133405 -0.1428755 -0.3001175 0.0391694 0.0145661 -0.3233098 -0.1278086 -0.0147319 -0.0241701 -0.024037 -0.2029139 1.9564504 0.1016403 0.0187289 0.3794765 0.1875534 -0.025037 0.1815367 -0.0158987 0.1798878 0.0810924 -0.0719376 -0.0056589 -0.0658316 -0.0107184 0.0039058 -0.0009708 0.0083213 0.1803571 0.0236859 0.096123 -0.0083547 0.0993762 -0.0064305 0.0114747 -0.0154292 0.0089279 0.1501746 -0.0864274 -0.035579 -0.0132522 -0.0359566 0.0920117 0.0004299 -0.0216382 -0.0017364 0.1599525 0.0766341 -0.0538153 -0.0000977 -0.0684883 -0.0685933 0.0064541 0.0001137 0.0050855 0.1511025 0.0510901 0.0711159 -0.0102593 0.0671025 0.071714 0.008844 -0.0375605 0.0207045 0.1829937 -2.4449711 0.2312539 0.0571034 0.3226914 -0.7342462 -0.1584493 -0.0796812 -0.169266 -0.3437568 0.8847897 -0.3366457 -0.0253126 -0.5762809 0.3710024 0.3251199 -0.1748985 0.3966627 0.0245164 -0.0613569 0.0011737 -0.0123343 -0.1117525 0.0835709 -0.082856 0.078404 -0.0704946 0.1424091 -0.0007155 -0.049577 -0.0748102 0.039823 0.0876773 -0.0652745 0.0215029 -0.1450477 0.0250159 unknown
polarizability: 143.5868429|-3.2693339|116.0088838|2.8875411|-0.048592|43.1912105 unknown
InChI: InChI=1/C7H7O/c1-8-7-5-3-2-4-6-7/h2-6H,1H2
charge 0 multiplicity 2
15 atoms
C  0.400647 -1.298165 0.005454
C  1.762326 -1.029535 0.07816
C  2.22513 0.287416 0.061563
C  1.312608 1.334214 -0.036071
C  -0.057127 1.082705 -0.114084
C  -0.501627 -0.238178 -0.0853
H  0.021589 -2.314969 0.023223
H  2.465019 -1.85358 0.151934
H  3.288677 0.493459 0.120303
H  1.663031 2.36136 -0.060085
H  -0.76581 1.897707 -0.21272
O  -1.829658 -0.576919 -0.174191
C  -2.764483 0.360264 0.156324
H  -3.774075 0.004456 0.001448
H  -2.526004 1.034594 0.973148
