program: Gaussian 09
title: Title Card Required
version: AM64L-G09RevD.01
frameworkgroup: C1[X(C7H8O3)]
method: RM062X
basis: Gen
operation: Freq
keyword: #p
keyword: freq=noraman
keyword: gen
keyword: integral=grid=ultrafine
keyword: m062x
keyword: scrf(solvent=acetonitrile,SMD)
title: #p freq=noraman gen integral=grid=ultrafine m062x scrf(solvent=acetoni
basis: NPDir=0 NMtPBC= 1 NCelOv= 1 NCel= 1 NClECP= 1 NCelD= 1
basis: NCelK= 1 NCelE2= 1 NClLst= 1 CellRange= 0.0.
basis: One-electron integrals computed using PRISM.
basis: NBasis= 192 RedAO= T EigKep= 4.59D-04 NBF= 192
basis: NBsUse= 192 1.00D-06 EigRej= -1.00D+00 NBFU= 192
converged: YES YES NO YES
title: Mulliken charges:
elementType: C C C C C C H H H H H O C H H O O H
charge: -0.173534 -0.156424 -0.151064 -0.160570 -0.167038 0.324061 0.169647 0.158833 0.152072 0.158522 0.169397 -0.563723 0.265247 0.164669 0.149301 -0.268430 -0.489995 0.419027
chargesum: 0.00000
title: Mulliken charges with hydrogens summed into heavy atoms:
elementType: C C C C C C O C O O
charge: -0.003887 0.002409 0.001009 -0.002047 0.002359 0.324061 -0.563723 0.579218 -0.268430 -0.070969
polarizability: 1.51863561e+02 -1.18110323e+00 1.29524005e+02 -1.05873052e+01 7.64248143e+00 5.68185047e+01
1716.lowfreq: -27.0739 -13.6637 0.0007 0.0010 0.0013 19.0080 44.8927 57.1108 149.9229
frequency: 40.6239 56.3846 149.5240 212.8370 264.9574 305.3361 348.4651 366.2573 425.8562 523.3824 545.8092 606.8529 636.3776 708.6714 779.4344 809.7208 853.0979 926.4794 998.2227 1013.6966 1020.2457 1034.1849 1063.1197 1095.1365 1115.1060 1157.2626 1167.8334 1178.6542 1200.2572 1275.6556 1308.6206 1345.4996 1361.6547 1403.7824 1460.4546 1507.0337 1545.7600 1548.8466 1679.5945 1689.5483 3082.1730 3167.9382 3224.6779 3230.1816 3238.6100 3247.1120 3255.9680 3760.6531
redmass: 5.3444 5.3296 4.8369 4.2506 1.2482 2.5839 7.5516 4.2673 3.0208 3.2221 5.4205 5.6526 6.2392 2.2381 1.6206 5.0204 1.2490 1.4124 1.3460 5.2350 1.2841 12.6923 2.1456 7.8998 1.4628 2.7044 1.1556 1.5825 1.2076 1.6787 2.1398 1.7414 2.5116 1.1298 1.2284 2.4896 1.2417 1.9422 6.5110 6.5362 1.0598 1.1090 1.0866 1.0902 1.0944 1.0982 1.0945 1.0687
irintensity: 1.1106 5.0869 16.2050 3.0487 153.8043 46.3704 13.5802 5.1706 0.1291 7.0248 5.3426 5.7247 9.0806 28.1928 102.6177 28.4432 0.3565 13.2294 0.0388 1.1502 0.1778 67.9496 4.7434 132.5816 9.7083 56.4775 5.9675 30.8720 25.4773 276.3408 192.5010 62.1969 42.9175 86.4565 54.6648 1.3497 37.1307 140.5055 41.8925 69.6802 44.4649 32.1742 1.5252 7.2588 10.9037 10.7439 0.8667 136.4816
temp: 298.150 k
press: 1.00000 atm
elementType: 6 6 6 6 6 6 1 1 1 1 1 8 6 1 1 8 8 1
symmnumber: 1
zpe: 376450.2 jmol-1
zpe.correction: 0.143382 hartree
zpe.thermalcorrener: 0.152388 hartree
zpe.thermalcorrenthalpy: 0.153333 hartree
zpe.thermalcorrgfe: 0.108217 hartree
zpe.sumelectzpe: -496.798701 hartree
zpe.sumelectthermal: -496.789694 hartree
zpe.sumelectthermalent: -496.788750 hartree
zpe.sumelectthermalfe: -496.833866 hartree
dipole: 1.1929 2.4217 2.3857
dipole: 3.6027
quadrupole: -56.1429 -49.3030 -61.5619
quadrupole: -4.5199 -6.6547 0.7774
quadrupole: -0.4736 6.3662 -5.8927 -4.5199 -6.6547 0.7774
hfenergy: -496.9420829 hartree
pointgroup: C01 [X(C7H8O3)]
dipole: 0.4693052 0.9527715 0.9386111 debye
dipolederiv: -0.4068731 -0.1677473 0.0017271 0.0913026 0.0278214 0.0187678 0.0498327 0.0480822 -0.1967345 0.1275478 0.0581384 -0.0220741 -0.0708339 0.1708736 0.048325 -0.0427705 0.0297035 -0.1338927 -0.0914395 0.1567425 0.012402 0.1260616 -0.2448844 -0.0251425 0.0114446 -0.0264994 -0.1708128 0.1710475 -0.1090092 -0.0527957 0.0563679 0.1479512 0.0276123 -0.0302679 0.0368914 -0.1362009 -0.2182622 -0.0073778 0.0224297 -0.3529296 -0.2092376 0.0417328 -0.0270065 -0.006704 -0.1945033 1.682091 0.5538668 -0.1121653 0.8699367 0.4513531 -0.0882696 -0.0464943 -0.0239773 0.1819768 0.11317 -0.0331631 0.0039525 -0.0306329 -0.0356644 -0.0203606 0.0078768 -0.0161251 0.1786093 -0.0295148 0.0854134 0.0322753 0.0867989 0.0541909 -0.0210046 0.0282804 -0.0223445 0.144866 -0.0503148 -0.0809829 0.0154142 -0.08176 0.0568652 -0.0019668 0.0148597 -0.0033411 0.1580295 0.0998074 -0.000315 0.0065053 -0.0146398 -0.0837155 -0.0243205 0.0035362 -0.0212171 0.1482171 -0.0032049 0.0635051 0.0279776 0.0664703 0.1025077 -0.0177596 0.0278426 -0.0176086 0.1787888 -2.431797 -0.3105056 0.1964543 -0.3309472 -0.767733 0.0230521 0.2671121 0.0061649 -0.4916913 1.7311032 -0.1212849 0.0325407 -0.664426 0.8703712 -0.0684577 0.1100797 -0.2684078 0.9747043 -0.0965857 -0.0783108 0.0392601 -0.0452301 -0.0382114 0.0542741 -0.0508544 0.0268743 0.0416896 -0.0155273 -0.0305477 -0.0529359 0.0914652 -0.0471685 -0.1261287 -0.0479409 -0.0132393 -0.0628044 -0.4838323 -0.0070839 -0.0668544 -0.01235 -0.4399095 0.1325679 -0.3274614 0.2973346 -0.592237 -0.3306746 0.0554616 -0.0963042 0.3213557 -0.4094317 0.0833382 0.0186133 -0.0073683 -0.4523345 0.2332593 -0.0267998 0.0121909 -0.1060094 0.3940218 -0.0362595 0.033318 -0.0182185 0.4243301 unknown
polarizability: 151.8635605|-1.1811038|129.5240049|-10.587305|7.6424817|56.8185047 unknown
InChI: InChI=1/C7H8O3/c8-10-6-9-7-4-2-1-3-5-7/h1-5,8H,6H2
charge 0 multiplicity 1
18 atoms
C  1.633021 -1.243969 -0.148622
C  2.852647 -0.581771 -0.218279
C  2.913992 0.80394 -0.06314
C  1.740941 1.518822 0.156352
C  0.506614 0.870494 0.221851
C  0.464834 -0.514977 0.075373
H  1.567026 -2.321354 -0.262244
H  3.759376 -1.152661 -0.391992
H  3.867038 1.319305 -0.117078
H  1.773699 2.597688 0.271641
H  -0.39862 1.447498 0.37191
O  -0.692623 -1.261361 0.134471
C  -1.864851 -0.635728 0.52718
H  -2.584093 -1.417511 0.779489
H  -1.712118 0.047424 1.371506
O  -2.334481 0.097844 -0.607139
O  -3.535876 0.729322 -0.185576
H  -3.251664 1.652306 -0.061571
