program: Gaussian 09
title: Title Card Required
version: AM64L-G09RevD.01
frameworkgroup: C1[X(C7H6O2)]
method: RM062X
basis: Gen
operation: Freq
keyword: #p
keyword: freq=noraman
keyword: gen
keyword: integral=grid=ultrafine
keyword: m062x
keyword: scrf(solvent=acetonitrile,SMD)
title: #p freq=noraman gen integral=grid=ultrafine m062x scrf(solvent=acetoni
basis: NPDir=0 NMtPBC= 1 NCelOv= 1 NCel= 1 NClECP= 1 NCelD= 1
basis: NCelK= 1 NCelE2= 1 NClLst= 1 CellRange= 0.0.
basis: One-electron integrals computed using PRISM.
basis: NBasis= 164 RedAO= T EigKep= 4.65D-04 NBF= 164
basis: NBsUse= 164 1.00D-06 EigRej= -1.00D+00 NBFU= 164
converged: YES YES NO NO
title: Mulliken charges:
elementType: C C C C C C H H H H H O C H O
charge: -0.145436 -0.160071 -0.137498 -0.160970 -0.137729 0.294296 0.176179 0.164683 0.159107 0.164788 0.175785 -0.511181 0.498093 0.181320 -0.561367
chargesum: 0.00000
title: Mulliken charges with hydrogens summed into heavy atoms:
elementType: C C C C C C O C O
charge: 0.030743 0.004613 0.021609 0.003818 0.038056 0.294296 -0.511181 0.679412 -0.561367
polarizability: 1.28797585e+02 -1.60537725e+00 1.13639958e+02 -1.51897869e+01 -3.59049906e+00 5.89762266e+01
1716.lowfreq: -16.2221 -0.0013 -0.0011 0.0003 5.9341 23.8501 40.2746 119.6745 214.6566
frequency: 38.4708 119.6218 214.5553 275.3122 422.7639 453.0305 499.6183 523.0571 623.9074 706.9047 752.0245 789.4836 864.0402 865.1370 955.2539 1005.5493 1018.0042 1030.1623 1056.9637 1059.7028 1103.0302 1163.7247 1168.3258 1185.1471 1246.4255 1329.2672 1349.4304 1423.5938 1503.7031 1539.3263 1680.5332 1688.8079 1835.4743 3157.3279 3226.5379 3232.7624 3238.3909 3243.3628 3249.3517
redmass: 6.4070 6.6105 2.5376 5.0527 2.9658 5.2326 5.6487 3.8929 6.4313 2.6305 1.8628 3.9597 2.4559 1.4899 1.5691 1.3539 5.8855 1.2887 2.0719 1.6267 1.3868 2.3148 1.1058 1.4253 5.8395 1.7420 3.1627 1.1559 2.4711 2.4802 6.3977 7.0240 9.3988 1.0963 1.0869 1.0899 1.0935 1.0971 1.0999
irintensity: 1.9731 6.1052 26.7343 6.9853 0.0189 22.5805 15.1039 7.5671 0.0347 24.7808 75.3413 10.3758 34.3619 11.9964 15.8663 0.1095 10.7377 0.1230 6.6988 0.4766 17.4084 122.7644 0.0496 90.2995 645.0249 1.4812 0.7641 6.7413 6.4816 105.7857 33.1900 13.3311 518.8715 30.5680 0.4847 4.6122 7.6903 4.3459 4.4791
temp: 298.150 k
press: 1.00000 atm
elementType: 6 6 6 6 6 6 1 1 1 1 1 8 6 1 8
symmnumber: 1
zpe: 304079.3 jmol-1
zpe.correction: 0.115818 hartree
zpe.thermalcorrener: 0.123075 hartree
zpe.thermalcorrenthalpy: 0.124019 hartree
zpe.thermalcorrgfe: 0.083060 hartree
zpe.sumelectzpe: -420.532340 hartree
zpe.sumelectthermal: -420.525082 hartree
zpe.sumelectthermalent: -420.524138 hartree
zpe.sumelectthermalfe: -420.565097 hartree
dipole: -1.2132 -0.6828 -1.7335
dipole: 2.2233
quadrupole: -41.9192 -44.6977 -58.1198
quadrupole: -2.3795 -7.1689 -3.4808
quadrupole: 6.3264 3.5478 -9.8742 -2.3795 -7.1689 -3.4808
hfenergy: -420.6481573 hartree
pointgroup: C01 [X(C7H6O2)]
dipole: -0.4772942 -0.2686158 -0.6820224 debye
dipolederiv: -0.2432639 -0.0544093 -0.0354888 -0.1098103 -0.0333964 0.0378297 0.0283159 0.0035276 -0.1377881 0.0221268 0.0433672 -0.0518414 0.0685978 0.065675 -0.0641422 -0.0722531 -0.03748 -0.1267265 0.060356 -0.035641 -0.0599214 -0.0302102 -0.162043 0.0192531 -0.0538021 0.0118796 -0.1212648 -0.0080588 -0.0380026 -0.0369801 -0.0664477 0.119476 -0.0044865 -0.0347213 -0.0199684 -0.1343555 -0.1873272 0.0484701 -0.0451728 0.1596711 -0.0952109 -0.0591874 0.0181751 0.0013644 -0.1220883 1.4343667 -0.0571202 -0.1169897 -0.1738902 0.2898113 -0.0248427 -0.3153761 -0.036954 0.1301881 0.0866224 0.072776 0.0219599 0.0685697 0.0196833 0.0069808 0.0256926 -0.0004632 0.173865 0.0456786 -0.0756173 0.0317758 -0.076971 -0.0006917 0.0413248 0.0408467 0.0395808 0.1390472 -0.060718 0.0262661 0.0550624 0.0282325 0.1002087 0.0003727 0.0591767 -0.0008395 0.141909 0.0769797 0.0592462 0.0056062 0.0675055 -0.0437943 0.0102628 0.0129923 0.0106267 0.1508387 0.0473632 -0.0682162 0.0505488 -0.0583369 0.0646288 0.0296437 0.0441561 0.0308371 0.1602655 -2.377816 -0.1477144 -0.3802391 -0.1582643 -0.5002642 -0.2282952 -0.3092801 -0.2222008 -0.8531057 1.9548397 0.1459619 0.3779226 0.487811 0.6813326 0.6562156 1.0158001 0.6290477 1.8567103 -0.0509875 0.0262299 0.0505208 0.0100673 0.1221895 -0.0333234 0.0296232 -0.0350967 0.0586188 -0.8001617 0.0544035 0.1332366 -0.2165242 -0.6276047 -0.3876058 -0.489346 -0.3738612 -1.3161138 unknown
polarizability: 128.7975851|-1.605376|113.6399576|-15.1897866|-3.5905003|58.9762266 unknown
InChI: InChI=1/C7H6O2/c8-6-9-7-4-2-1-3-5-7/h1-6H
charge 0 multiplicity 1
15 atoms
C  -0.597234 -1.291272 -0.04169
C  -1.93166 -1.081266 0.302622
C  -2.467667 0.204737 0.283102
C  -1.670688 1.28862 -0.085117
C  -0.337328 1.093543 -0.43598
C  0.174896 -0.197435 -0.404686
H  -0.157507 -2.283266 -0.036321
H  -2.550221 -1.926851 0.584977
H  -3.506852 0.363239 0.551872
H  -2.086772 2.290594 -0.102962
H  0.29866 1.922433 -0.730321
O  1.495004 -0.428177 -0.810466
C  2.485554 -0.053135 0.019194
H  3.454157 -0.276191 -0.442398
O  2.331658 0.444087 1.104277
