program: Orca
programVersion: 6.1.0
elementType: Ru Cl O N C C H C H H H C C H H H O C C H H H Cl N C C H H H
elementType: Ru
charge: 0
multiplicity: 2
keywords: ROKS PBE0 def2-TZVPP TightSCF CPCM(chloroform) NormalPrint
formula: C9H13Cl2N2O2Ru
InChI: InChI=1/C5H7O2.2C2H3N.2ClH.Ru/c1-4(6)3-5(2)7;2*1-2-3;;;/h3H,1-2H3;2*1H3;2*1H;/q-2;;;;;+4/p-2/rC9H13Cl2N2O2Ru/c1-5-12-16(10,11,13-6-2)14-8(3)7-9(4)15-16/h7H,1-4H3
29 atoms
Ru -0.397863 0.012195 -0.10887
Cl -1.976706 1.711065 0.088076
O  1.043304 -1.38964 -0.283025
N  -0.475625 0.182999 -2.095547
C  2.2750 -1.247193 -0.008561
C  2.901871 -0.034422 0.281878
H  3.961908 -0.056075 0.48777
C  3.077853 -2.509587 -0.048669
H  2.650998 -3.231282 0.650857
H  3.009919 -2.947865 -1.046688
H  4.122763 -2.335929 0.198553
C  -0.54754 0.287254 -3.232983
C  -0.646165 0.417894 -4.665262
H  0.232412 -0.023905 -5.136413
H  -1.541228 -0.096583 -5.016602
H  -0.708122 1.473285 -4.932667
O  1.053863 1.41127 -0.041882
C  2.284034 1.214732 0.204708
C  3.095717 2.459259 0.384535
H  3.027528 3.068005 -0.519543
H  2.676036 3.04786 1.202988
H  4.139964 2.237483 0.592919
Cl -1.98979 -1.68353 -0.201879
N  -0.311657 -0.158267 1.876509
C  -0.294097 -0.259098 3.016551
C  -0.277238 -0.386447 4.45257
H  0.229951 0.4733 4.891577
H  -1.30106 -0.430296 4.825703
H  0.24855 -1.299416 4.733828
elementType: Ru Cl O N C H
totalener: -1625.44841349459853 hartree
nucrepener: 1562.20608807545773 hartree
electener: -3187.61288299943772 hartree
oneelecener: -5380.41172123920387 hartree
twoeener: 2192.79883823976616 hartree
cpcmener: -0.04161857061835 hartree
kineticenergy: 1560.49589238841077 hartree
exchangeener: -108.785935116223 hartree
correlationener: -5.229887783453 hartree
xcener: -114.015822899675 hartree
energy: -2765.8475 -2765.8474 -523.2335 -523.2329 -392.7010 -392.6613 -280.7151 -280.7150 -280.3770 -280.3386 -279.4158 -279.3895 -278.1509 -278.1505 -277.9029 -257.6749 -257.6748 -195.9385 -195.9381 -195.8436 -195.8436 -195.8177 -195.8174 -84.4518 -52.7614 -52.7585 -52.4305 -29.6895 -29.3188 -26.7332 -26.6501 -22.2843 -21.9831 -21.9495 -21.1715 -21.1551 -20.9767 -19.9049 -16.7317 -15.6714 -15.4267 -14.7908 -14.6365 -13.9213 -13.8509 -13.3057 -13.1959 -13.1193 -13.1155 -13.0608 -12.5785 -12.4629 -12.2739 -11.6708 -11.4256 -11.2668 -11.2531 -11.0387 -10.5787 -10.5764 -10.3828 -10.1575 -9.9465 -9.7888 -9.0020 -8.5713 -8.3214 -8.2277 -8.0177 -7.5860 -7.3579 -6.5685 -6.2947 -7.3486 -1.4586 -0.9942 -0.3800 0.0891 0.0810 0.6981 0.7266 0.7363 0.8418 1.5260 1.5932 electronvolt
chargesum: -0.0000000
charge: 0.044237 -0.435946 -0.364178 0.244645 0.374895 -0.377391 0.110706 -0.254450 0.113486 0.113880 0.098416 -0.105781 -0.097852 0.139867 0.143678 0.142162 -0.364210 0.374730 -0.253915 0.113622 0.113462 0.098406 -0.436057 0.236080 -0.099677 -0.099153 0.141040 0.144514 0.140786
charge: -0.446192 -0.103796 0.156847 0.171696 -0.252357 -0.090545 0.022765 0.033316 0.032540 0.033203 0.024589 -0.047919 0.040380 0.054279 0.055928 0.055175 0.156976 -0.252353 0.033383 0.033085 0.032603 0.024581 -0.104051 0.174948 -0.045883 0.040875 0.054790 0.056402 0.054733
qa: 0.0442 -0.4359 -0.3642 0.2446 0.3749 -0.3774 0.1107 -0.2545 0.1135 0.1139 0.0984 -0.1058 -0.0979 0.1399 0.1437 0.1422 -0.3642 0.3747 -0.2539 0.1136 0.1135 0.0984 -0.4361 0.2361 -0.0997 -0.0992 0.1410 0.1445 0.1408
va: 5.6816 0.9824 2.1404 3.3825 3.8051 3.8578 1.0158 3.9672 1.0068 1.0066 1.0136 3.8248 3.8789 0.9987 0.9981 0.9982 2.1402 3.8055 3.9671 1.0068 1.0067 1.0136 0.9822 3.3862 3.8190 3.8789 0.9984 0.9978 0.9985
energy: -1625.448413494599 hartree
dipole: 51.561685025 -47.679097082 3.882587943 -0.616559337 0.592149422 -0.024409915 5.322634198 -5.134248428 0.188385770
dipolemethod: SCF
magnitude: 3.887232201 au
magnitude: 9.880559033 debye
