program: Orca
programVersion: 6.0.0
elementType: Ru Cl Cl O O N N C C H C C H H H C H H H C C H H H C C H H H
elementType: Ru
charge: 0
multiplicity: 2
keywords: PBE0 def2-TZVPP TightSCF Opt Freq CPCM(chloroform)
frequency: 0.00 0.00 0.00 0.00 0.00 0.00 36.86 40.78 43.10 45.65 52.49 53.38 60.03 69.81 77.64 91.78 109.08 138.53 173.62 209.51 211.23 217.34 221.68 249.71 255.90 261.90 264.05 284.09 299.36 309.46 323.80 338.44 420.72 455.48 464.63 470.94 473.72 476.31 572.47 656.01 684.86 701.83 810.14 961.13 969.05 983.66 983.74 1037.26 1037.56 1041.88 1042.61 1043.01 1043.54 1050.19 1055.78 1229.64 1309.92 1367.26 1381.10 1384.61 1388.52 1389.58 1435.40 1436.45 1436.88 1437.49 1452.03 1452.20 1459.90 1466.39 1567.27 1610.72 2419.94 2423.45 3058.67 3058.86 3068.79 3068.85 3126.35 3126.52 3155.35 3155.55 3155.78 3156.45 3169.19 3169.64 3231.08
frequency: 36.86 40.78 43.10 45.65 52.49 53.38 60.03 69.81 77.64 91.78 109.08 138.53 173.62 209.51 211.23 217.34 221.68 249.71 255.90 261.90 264.05 284.09 299.36 309.46 323.80 338.44 420.72 455.48 464.63 470.94 473.72 476.31 572.47 656.01 684.86 701.83 810.14 961.13 969.05 983.66 983.74 1037.26 1037.56 1041.88 1042.61 1043.01 1043.54 1050.19 1055.78 1229.64 1309.92 1367.26 1381.10 1384.61 1388.52 1389.58 1435.40 1436.45 1436.88 1437.49 1452.03 1452.20 1459.90 1466.39 1567.27 1610.72 2419.94 2423.45 3058.67 3058.86 3068.79 3068.85 3126.35 3126.52 3155.35 3155.55 3155.78 3156.45 3169.19 3169.64 3231.08
formula: C9H13Cl2N2O2Ru
InChI: InChI=1/C5H7O2.2C2H3N.2ClH.Ru/c1-4(6)3-5(2)7;2*1-2-3;;;/h3H,1-2H3;2*1H3;2*1H;/q-2;;;;;+4/p-2/rC9H13Cl2N2O2Ru/c1-5-12-16(10,11,13-6-2)14-8(3)7-9(4)15-16/h7H,1-4H3
29 atoms
Ru -0.08585 -0.045687 -0.005413
Cl -0.114339 0.049158 -2.340805
Cl -0.138802 -0.142323 2.329277
O  1.313776 -1.462899 -0.054941
O  1.256891 1.424875 0.061148
N  -1.423667 -1.542908 -0.074259
N  -1.480472 1.399165 0.0465
C  2.565483 -1.238916 -0.036483
C  3.17176 0.017591 0.016602
H  4.251873 0.038666 0.024098
C  2.516541 1.249613 0.060523
C  3.419185 -2.467749 -0.076299
H  3.176973 -3.101298 0.779595
H  4.480089 -2.228956 -0.060683
H  3.188456 -3.037899 -0.978691
C  3.32105 2.510746 0.11205
H  3.064945 3.135785 -0.746063
H  4.390732 2.314004 0.109364
H  3.057278 3.070216 1.012101
C  -2.147411 -2.428945 -0.114082
C  -3.056829 -3.545883 -0.164553
H  -3.833133 -3.420509 0.591042
H  -2.511583 -4.470684 0.026794
H  -3.51791 -3.595967 -1.151651
C  -2.236581 2.258036 0.079639
C  -3.185123 3.342419 0.120286
H  -4.060472 3.043389 0.697771
H  -3.491415 3.595909 -0.895337
H  -2.724074 4.213758 0.586629
totalener: -1625.31944303221553 hartree
nucrepener: 1564.91699084749075 hartree
electener: -3190.19849044968669 hartree
oneelecener: -5385.52148038772430 hartree
twoeener: 2195.32298993803761 hartree
cpcmener: -0.03798194537938 hartree
kineticenergy: 1562.89770461929220 hartree
exchangeener: -109.202660336803 hartree
correlationener: -5.245278574074 hartree
xcener: -114.447938910878 hartree
s2: 0.756677
s2: 0.756711
s2: 0.756756
s2: 0.756783
s2: 0.756796
s2: 0.756803
s2: 0.756814
s2: 0.756815
s2: 0.756812
s2: 0.756788
s2: 0.756776
s2: 0.756770
s2: 0.756768
s2: 0.756767
s2: 0.756764
s2: 0.756763
s2: 0.756765
s2: 0.756769
s2: 0.756771
s2: 0.756773
s2: 0.756772
s2: 0.756766
s2: 0.756774
s2: 0.756778
s2: 0.756782
s2: 0.756781
elementType: Ru Cl O N C H
s2: 0.756779
energy: -2765.9420 -2765.9416 -523.1413 -523.1413 -392.6929 -392.6928 -280.5471 -280.5469 -280.4023 -280.4014 -279.4293 -279.4288 -278.0246 -278.0244 -277.8595 -257.7642 -257.7639 -196.0215 -196.0214 -195.9529 -195.9526 -195.9060 -195.9057 -84.7631 -53.3201 -53.2748 -52.4820 -29.5548 -29.2290 -26.7394 -26.6927 -22.1868 -22.0010 -21.9950 -21.2962 -21.0542 -21.0516 -19.7751 -16.6382 -15.8632 -15.2088 -14.8160 -14.4889 -13.7820 -13.4488 -13.4298 -13.1980 -13.1817 -13.1729 -13.1060 -12.9168 -12.3782 -12.1479 -11.5693 -11.2855 -11.2401 -11.1036 -10.8531 -10.7630 -10.7083 -10.5609 -10.3101 -10.3009 -9.2999 -8.9541 -8.4734 -8.4718 -8.4390 -8.1501 -7.9996 -7.2814 -6.8979 -6.6133 -6.4467 -1.2514 -1.1215 -0.0813 0.2463 0.3585 0.3885 0.5107 0.6694 1.0268 1.2608 1.8251 electronvolt
energy: -2765.9290 -2765.9287 -523.1204 -523.1203 -392.7026 -392.7024 -280.5567 -280.5565 -280.3968 -280.3959 -279.4295 -279.4290 -278.0248 -278.0245 -277.8429 -257.7525 -257.7523 -196.0201 -196.0200 -195.9056 -195.9053 -195.8991 -195.8988 -83.9317 -52.1541 -52.1043 -51.9778 -29.5155 -29.1887 -26.7385 -26.6922 -22.1679 -21.9993 -21.9941 -21.2141 -21.0547 -20.9716 -19.7652 -16.6376 -15.8400 -15.1676 -14.8080 -14.4741 -13.7675 -13.4345 -13.4245 -13.1724 -13.1653 -13.1644 -13.1071 -12.8204 -12.3295 -12.1486 -11.5432 -11.2844 -11.0353 -10.8729 -10.8543 -10.7559 -10.6618 -10.4198 -10.3175 -10.2277 -9.2564 -8.4679 -8.4525 -8.3321 -8.2183 -7.9815 -7.8904 -6.8746 -6.5602 -6.1540 -3.2682 -1.2415 -0.8538 0.2818 0.3528 0.4086 0.4298 0.5460 0.6743 1.0290 1.2674 electronvolt
chargesum: 0.0000000
charge: 0.063083 -0.443140 -0.443245 -0.361786 -0.361728 0.219816 0.220100 0.402961 -0.385545 0.109822 0.402991 -0.270563 0.117186 0.101758 0.117025 -0.270819 0.117263 0.101797 0.117006 -0.102540 -0.115023 0.146212 0.147337 0.147125 -0.102603 -0.114890 0.145386 0.147288 0.147725
charge: -0.448426 -0.104282 -0.104080 0.154554 0.154552 0.173895 0.173917 -0.253266 -0.080537 0.024915 -0.253230 0.031460 0.032110 0.024210 0.032021 0.031393 0.032107 0.024234 0.032050 -0.046368 0.040833 0.055306 0.055617 0.055871 -0.046414 0.040824 0.054945 0.056026 0.055764
qa: 0.0631 -0.4431 -0.4432 -0.3618 -0.3617 0.2198 0.2201 0.4030 -0.3855 0.1098 0.4030 -0.2706 0.1172 0.1018 0.1170 -0.2708 0.1173 0.1018 0.1170 -0.1025 -0.1150 0.1462 0.1473 0.1471 -0.1026 -0.1149 0.1454 0.1473 0.1477
va: 5.5851 0.9721 0.9719 2.1617 2.1617 3.4199 3.4195 3.7590 3.9217 1.0126 3.7586 3.9576 1.0052 1.0129 1.0053 3.9577 1.0052 1.0128 1.0053 3.8369 3.8756 0.9963 0.9962 0.9963 3.8367 3.8756 0.9965 0.9964 0.9959
energy: -1625.451772384080 hartree
dipole: 17.512450345 -19.976360382 -2.463910037 0.381167248 -0.424491755 -0.043324508 0.162178550 -0.174521479 -0.012342928
dipolemethod: SCF
magnitude: 2.464321820 au
magnitude: 6.263808274 debye
temp: 298.15 k
press: 1.00 atm
zeropoint: 0.21101663 hartree
thermalvibcorrection: 0.01895835 hartree
thermalrotcorrection: 0.00141627 hartree
thermaltrasncorrection: 0.00141627 hartree
thermaltotal: -1625.21896486 hartree
thermalcorr: 0.02179089 hartree
nonthermalcorr: 0.21101663 hartree
totalcorr: 0.23280752 hartree
thermalcorrenthalpy: 0.00094421 hartree
totalenthalpy: -1625.21802065 hartree
vibrat: 0.03473881 hartree
rotat: 0.01595159 hartree
transl: 0.02065835 hartree
total: 0.07200320 hartree
totalentropycorr: -0.07200320 hartree
gibbsenthalpy: -1625.29002386 hartree
gibbsminuselec: 0.16174853 hartree
