program: AMS
programVersion: 2024.102
runtype: SINGLE POINT
method: DFT
functional: PBE0 == Not Default ==
basis: TZ2P
spinMolecule: Restricted
spinMolecule: UNrestricted
formula: C15H17Cl2N2O2Ru
InChI: InChI=1/15C.2Cl.2N.2O.Ru.17H
39 atoms
Ru 0.027596 -0.413574 -0.004171
Cl 2.340274 -0.716321 0.140886
N  -0.149361 -0.509420 2.070954
O  0.313291 1.573670 0.149203
O  -1.955957 -0.087883 -0.123885
Cl -0.381597 -2.707228 -0.184467
C  -0.556363 2.487516 -0.003106
C  -2.543589 1.032568 -0.240954
C  -1.918083 2.277908 -0.214012
C  -0.021717 3.881631 0.074648
C  -4.027630 0.949035 -0.403108
H  -2.544660 3.151038 -0.320230
H  -0.803588 4.625701 -0.054944
H  0.741450 4.018789 -0.693721
H  0.462586 4.028842 1.041633
H  -4.261831 0.346380 -1.282535
H  -4.482209 1.931219 -0.505340
H  -4.456381 0.439517 0.461760
C  0.701825 0.154468 2.859565
C  0.593454 0.147464 4.235346
C  -0.431649 -0.570114 4.825363
C  -1.315633 -1.252652 4.008851
C  -1.143156 -1.198548 2.640635
H  1.490037 0.696771 2.356434
H  1.310982 0.699358 4.827311
H  -0.540080 -0.596410 5.902374
H  -2.134969 -1.827770 4.418495
H  -1.806243 -1.720718 1.965181
C  -0.765855 -0.818403 -2.863392
C  -0.752855 -0.680379 -4.236400
N  0.135501 -0.223233 -2.075403
H  -1.507012 -1.424916 -2.361713
C  0.227122 0.099212 -4.824493
H  -1.504354 -1.185461 -4.827956
C  1.082703 0.530079 -2.643557
C  1.159988 0.714657 -4.008983
H  0.264120 0.223639 -5.899455
H  1.795238 0.984026 -1.968960
H  1.948187 1.332368 -4.417594
elementType: Ru Cl N O O Cl C C C C C H H H H H H H C C C C C H H H H H C C N H C H C C H H H
mdcq: 1.16945460 -0.40258774 -0.39382280 -0.54706148 -0.51378231 -0.42573230 0.30864261 0.30822014 -0.36291061 0.04014015 0.04931527 0.09999678 0.00610143 0.01834416 0.05077224 0.02203417 0.00190426 0.05932511 0.23721845 -0.79144237 1.23567867 -0.78515089 0.21651765 0.06483198 0.24496139 -0.28625011 0.24657680 0.06202181 0.16118260 -0.27728621 -0.42709273 0.05002145 0.39855281 0.12728285 0.13741049 -0.25932834 -0.04429529 0.09246408 0.10777124
eener: -203.729966 electronvolt
kinener: 338.458237 electronvolt
coulombener: -129.043492 electronvolt
xcener: -289.009159 electronvolt
dispener: 0.000000 electronvolt
total: -310.909328 electronvolt
charge: 1.11998933 -0.44126299 -0.32023653 -0.61103907 -0.61089684 -0.44128215 0.35915458 0.35931050 -0.06285276 0.45938155 0.45947653 -0.09500718 -0.15284847 -0.12024258 -0.11535836 -0.12082004 -0.15275168 -0.11500237 0.22300953 0.04608730 0.06516447 0.04611900 0.22286627 -0.00565176 -0.05489147 -0.01970880 -0.05491856 -0.00566258 0.22749923 0.05061247 -0.32108804 -0.00813090 0.06868464 -0.06001516 0.22737905 0.05077180 -0.02756939 -0.00816620 -0.06010238
dipole: -1.82897747 2.50979125 -0.06413517
dipole: 2.510611
quadrupole: -12.33651514 7.46333317 -2.22789550 -20.86847161 -3.70209849 33.20498675
energy: 0.000000 electronvolt
charge: 0
charge: 1.1202 -0.4414 -0.3204 -0.6110 -0.6110 -0.4418 0.3591 0.3593 -0.0629 0.4594 0.4595 -0.0950 -0.1529 -0.1203 -0.1154 -0.1208 -0.1528 -0.1150 0.2231 0.0461 0.0652 0.0461 0.2229 -0.0056 -0.0549 -0.0197 -0.0549 -0.0056 0.2276 0.0506 -0.3213 -0.0081 0.0687 -0.0600 0.2275 0.0508 -0.0275 -0.0081 -0.0601
charge: 1.1202 -0.4417 -0.3204 -0.6111 -0.6109 -0.4413 0.3592 0.3593 -0.0629 0.4594 0.4595 -0.0950 -0.1529 -0.1202 -0.1154 -0.1208 -0.1528 -0.1150 0.2231 0.0461 0.0652 0.0461 0.2229 -0.0056 -0.0549 -0.0197 -0.0549 -0.0056 0.2275 0.0506 -0.3212 -0.0081 0.0687 -0.0600 0.2274 0.0508 -0.0276 -0.0081 -0.0601
charge: 1.1200 -0.4413 -0.3202 -0.6110 -0.6109 -0.4413 0.3592 0.3593 -0.0629 0.4594 0.4595 -0.0950 -0.1528 -0.1202 -0.1154 -0.1208 -0.1528 -0.1150 0.2230 0.0461 0.0652 0.0461 0.2229 -0.0057 -0.0549 -0.0197 -0.0549 -0.0057 0.2275 0.0506 -0.3211 -0.0081 0.0687 -0.0600 0.2274 0.0508 -0.0276 -0.0082 -0.0601
