program: AMS
programVersion: 2024.102
runtype: SINGLE POINT
method: DFT
functional: PBE0 == Not Default ==
basis: TZ2P
spinMolecule: Restricted
epsl: 4.80000
solvent: Chloroform angstrom
spinMolecule: UNrestricted
formula: C9H13Cl2N2O2Ru
InChI: InChI=1/9C.2Cl.2N.2O.Ru.13H
29 atoms
Ru 0.000000 0.000000 0.000000
Cl -1.568418 1.717709 0.085250
O  1.430228 -1.420317 -0.098091
N  -0.313212 -0.175951 -1.962930
C  2.683534 -1.240587 0.000000
C  3.323128 0.000000 0.000000
H  4.400233 0.007370 0.079740
C  3.493738 -2.496093 0.084320
H  3.162267 -3.082636 0.943675
H  3.315077 -3.100426 -0.807664
H  4.557934 -2.289122 0.172461
C  -0.519843 -0.270131 -3.084646
C  -0.788014 -0.389322 -4.496074
H  0.035180 -0.911985 -4.984186
H  -1.710879 -0.951005 -4.644754
H  -0.895785 0.604063 -4.932846
O  1.429768 1.379827 -0.348252
C  2.683044 1.220896 -0.218581
C  3.492708 2.472343 -0.354082
H  3.310147 2.915455 -1.335367
H  3.163957 3.196787 0.393962
H  4.557224 2.283172 -0.235411
Cl -1.567878 -1.675569 0.390722
N  0.321442 0.176011 1.960600
C  0.474343 0.274381 3.090706
C  0.661723 0.397992 4.514884
H  1.204906 1.317487 4.735395
H  -0.310402 0.426332 5.008366
H  1.229696 -0.455802 4.885716
elementType: Ru Cl O N C C H C H H H C C H H H O C C H H H Cl N C C H H H
mdcq: 1.38744302 -0.52868595 -0.62690382 -0.52429171 0.42857879 -0.45730437 0.10044533 0.06825267 0.02596591 0.05506521 -0.00266220 0.26417022 0.19928740 0.05499314 0.01944437 0.03934630 -0.61117882 0.44543199 0.08128803 0.03852515 0.02328661 -0.00372184 -0.51922815 -0.53596881 0.22967991 0.35569383 0.00118753 -0.01214590 0.00400618
eener: -135.500282 electronvolt
kinener: 261.539507 electronvolt
coulombener: -120.518375 electronvolt
xcener: -205.216049 electronvolt
solvener: -1.059530 electronvolt
dispener: 0.000000 electronvolt
total: -228.335869 electronvolt
charge: 1.17335552 -0.52295335 -0.60689056 -0.31628431 0.36167092 -0.11043594 -0.06673479 0.42937869 -0.10202790 -0.09452558 -0.12407706 0.23699277 0.48138731 -0.08235837 -0.07811922 -0.07974677 -0.60659644 0.36156284 0.42927244 -0.09484964 -0.10149502 -0.12405922 -0.52245511 -0.31779895 0.23689875 0.47849671 -0.08070529 -0.07619368 -0.08070873
dipole: 3.97090884 -0.02143380 -0.30046532
dipole: 0.301229
quadrupole: -16.76130369 1.24111372 14.11982434 -35.13821159 7.70163507 51.89951528
energy: 0.000000 electronvolt
charge: 0
charge: 1.1736 -0.5232 -0.6069 -0.3164 0.3617 -0.1105 -0.0667 0.4294 -0.1020 -0.0945 -0.1241 0.2372 0.4814 -0.0823 -0.0781 -0.0797 -0.6066 0.3616 0.4293 -0.0948 -0.1015 -0.1241 -0.5227 -0.3179 0.2371 0.4785 -0.0807 -0.0762 -0.0807
charge: 1.1736 -0.5233 -0.6069 -0.3164 0.3616 -0.1104 -0.0667 0.4294 -0.1020 -0.0945 -0.1241 0.2373 0.4814 -0.0823 -0.0781 -0.0797 -0.6066 0.3615 0.4293 -0.0949 -0.1015 -0.1241 -0.5228 -0.3179 0.2372 0.4785 -0.0807 -0.0762 -0.0807
charge: 1.1734 -0.5230 -0.6069 -0.3163 0.3617 -0.1104 -0.0667 0.4294 -0.1020 -0.0945 -0.1241 0.2370 0.4814 -0.0824 -0.0781 -0.0797 -0.6066 0.3616 0.4293 -0.0948 -0.1015 -0.1241 -0.5225 -0.3178 0.2369 0.4785 -0.0807 -0.0762 -0.0807
