program: AMS
programVersion: 2024.102
runtype: SINGLE POINT
method: DFT
functional: PBE0 == Not Default ==
basis: QZ4P-J
spinMolecule: Restricted
epsl: 4.80000
solvent: Chloroform angstrom
spinMolecule: UNrestricted
formula: C9H13Cl2N2O2Ru
InChI: InChI=1/9C.2Cl.2N.2O.Ru.13H
29 atoms
Ru 0.000000 0.000000 0.000000
Cl 0.025050 0.151021 -2.326382
Cl 0.008350 -0.149391 2.318022
O  1.369757 -1.458848 -0.038160
O  1.353327 1.459458 0.074740
N  -1.416337 -1.474848 -0.106541
N  -1.458428 1.438158 0.081010
C  2.628364 -1.252147 0.000000
C  3.238567 0.000000 0.000000
H  4.320073 0.000950 0.004690
C  2.631394 1.242707 0.049330
C  3.491138 -2.479383 0.067800
H  3.361128 -2.946926 1.046706
H  4.543264 -2.244402 -0.076240
H  3.166747 -3.199357 -0.684574
C  3.468448 2.478313 0.085380
H  3.212707 3.111466 -0.766464
H  4.532504 2.253232 0.061710
H  3.237717 3.043826 0.990325
C  -2.188352 -2.285602 -0.188901
C  -3.186307 -3.339938 -0.295202
H  -3.917301 -3.239427 0.507003
H  -2.701684 -4.313153 -0.217241
H  -3.693549 -3.269277 -1.257417
C  -2.311242 2.180571 0.112171
C  -3.423098 3.126136 0.141961
H  -4.167742 2.795255 0.865765
H  -3.878600 3.184187 -0.846594
H  -3.060306 4.113372 0.427872
elementType: Ru Cl Cl O O N N C C H C C H H H C H H H C C H H H C C H H H
mdcq: 1.38222916 -0.47914080 -0.47640500 -0.63363289 -0.62786524 -0.50832669 -0.50965361 0.26520737 -0.36146898 0.13326747 0.25116098 0.13643564 0.02931014 -0.00295551 0.03479617 0.09002396 0.04513294 0.01027967 0.04420561 0.32762195 0.00925107 0.08291184 0.09440800 0.07781947 0.30006889 0.11126001 0.05153603 0.05480648 0.06771587
eener: -134.883872 electronvolt
kinener: 310.490934 electronvolt
coulombener: -160.950172 electronvolt
xcener: -205.172388 electronvolt
solvener: -0.968889 electronvolt
dispener: 0.000000 electronvolt
total: -236.690254 electronvolt
charge: 1.29773663 -0.52108516 -0.51620811 -0.43315226 -0.44502990 -0.31988452 -0.31844739 0.21853070 -0.39225034 0.25952208 0.21708473 -0.69293763 0.26720932 0.24674516 0.25515610 -0.70984931 0.26546639 0.25038001 0.26447898 0.15779564 -0.71122411 0.32259258 0.30715551 0.32888585 0.14608930 -0.70414711 0.32644578 0.32878250 0.30415858
dipole: -2.85675710 -0.21731343 -0.03217193
dipole: 0.219682
quadrupole: 36.84479627 -0.20746653 1.65477136 17.75654332 4.20371244 -54.60133960
energy: 0.000000 electronvolt
charge: 0
charge: 1.2976 -0.5213 -0.5164 -0.4327 -0.4448 -0.3200 -0.3183 0.2183 -0.3920 0.2597 0.2168 -0.6929 0.2672 0.2467 0.2551 -0.7098 0.2654 0.2504 0.2644 0.1580 -0.7112 0.3226 0.3072 0.3289 0.1460 -0.7041 0.3264 0.3288 0.3041
charge: 1.2982 -0.5218 -0.5169 -0.4329 -0.4449 -0.3200 -0.3185 0.2183 -0.3920 0.2597 0.2169 -0.6929 0.2672 0.2467 0.2551 -0.7098 0.2654 0.2504 0.2645 0.1581 -0.7112 0.3227 0.3072 0.3289 0.1462 -0.7041 0.3265 0.3288 0.3042
charge: 1.2977 -0.5211 -0.5162 -0.4332 -0.4450 -0.3199 -0.3184 0.2185 -0.3923 0.2595 0.2171 -0.6929 0.2672 0.2467 0.2552 -0.7098 0.2655 0.2504 0.2645 0.1578 -0.7112 0.3226 0.3072 0.3289 0.1461 -0.7041 0.3264 0.3288 0.3042
